{"text_format":"3","workbook":"xlsx","n_sheets":4,"sheets":["Filtro","NOMBRE","BM18","BM18A"],"not_rendered":{"macros":1,"defined_names":1,"pivot_tables":1},"read":"whole","date_system":"1900"}

{"sheet":"Filtro","index":0,"n_rows":272,"n_cols":11,"rows_kept":272}
["IdEstablecimiento","(Todas)"]
["Comuna ","(Todas)"]
["Mes","(Todas)"]
[]
["Etiquetas de fila","Suma de Col01","Suma de Col02","Suma de Col03","Suma de Col04","Suma de Col05","Suma de Col06","Suma de Col07","Suma de Col08","Suma de Col09","Suma de Col10"]
["18010100",17472,0,17472]
["18010200",61089,447,60642]
["18010500",579,0,579]
["18010601",4281,0,4281]
["18010800",615,0,615]
["18010900",21279,267,21012]
["18011001",9050,8363,687]
["18011002",514,0,514]
["18020200",27,22,5]
["18020300",2178,1208,970]
["18020400",202,0,202]
["18020500",23205,4767,18438]
["18020600",31,25,6]
["18020700",272,195,77]
["18020800",237,233,4]
["18020900",147,0,147]
["18030000",1088,888,200]
["18040100",883,76,807]
["18040200",194,19,175]
["18050100",17867,3210,14657]
["18050200",452,81,371]
["18050300",117,74,43]
["18050400",1654,62,1592]
["18050500",10353,374,9979]
["18070100",20,7,13]
["18070300",158,66,83,0,1,5,3]
["18090000",5618,367,5251]
["18090100",12167,0,12167]
["18090200",1266,331]
["18400400",61,57,4]
["18400500",208,0,208]
["18400700",135743]
["18400900",1331,228,1103]
["18700100",24,0,21,3]
["18700240",6,null,6]
{"$rows_left_out":233}
{"sheet":"NOMBRE","index":1,"n_rows":42,"n_cols":33,"rows_kept":42,"hidden":true,"merged":[[0,0,0,1],[0,2,0,6],[1,8,1,13],[2,8,2,13],[8,0,8,1],[13,0,13,1],[16,1,18,1]]}
["DATOS DEL ESTABLECIMIENTO",null,"CÓDIGOS"]
["NOMBRE DE COMUNA",{"$nulls":7},{"$f":"IF(OR(NOMBRE!C2=\"\",NOMBRE!D2=\"\",NOMBRE!E2=\"\",NOMBRE!F2=\"\",NOMBRE!G2=\"\"),\"Falta Cód. Com.\",\"\")","v":"Falta Cód. Com."},{"$nulls":23},{"$f":"IF(I2>\"\",1,0)","v":1}]
["NOMBRE ESTABLECIMIENTO/ESTRATEGIA",{"$nulls":7},{"$f":"IF(OR(NOMBRE!C3=\"\",NOMBRE!D3=\"\",NOMBRE!E3=\"\",NOMBRE!F3=\"\",NOMBRE!G3=\"\",NOMBRE!H3=\"\"),\"Falta Cód. Est.\",\"\")","v":"Falta Cód. Est."},{"$nulls":23},{"$f":"IF(I3>\"\",1,0)","v":1}]
[]
[]
["MES:",{"$nulls":7},{"$f":"IF(OR(NOMBRE!C6=\"\",NOMBRE!D6=\"\"),\"Falta Cód. Mes.\",\"\")","v":"Falta Cód. Mes."},{"$nulls":23},{"$f":"IF(I6>\"\",1,0)","v":1}]
["AÑO:",2024,{"$nulls":30},{"$f":"SUM(AG2:AG6)","v":3}]
[{"$nulls":6}," "]
["Versión 1.0 FEBRERO 2024"]
[]
["Director/a Servicio de Salud o Director/a Establecimiento",{"$nulls":25},"ENERO","Establecimiento de Mayor Complejidad (EMAYC)","SERVICIO DE SALUD"]
["Jefe/a de Estadísticas",{"$nulls":25},"FEBRERO","Establecimiento de Mediana Complejidad (EMEDC)","MUNICIPAL"]
[{"$nulls":26},"MARZO","Establecimiento de Menor Complejidad (EMENC)","OTRA INSTITUCION (Delegado)"]
["MINSAL - DEIS",{"$nulls":25},"ABRIL","Centros de Diagnóstico Terapeutico (CDT)"]
[{"$nulls":26},"MAYO","Centro de Referencia de Salud (CRS)"]
[{"$nulls":26},"JUNIO","Centro de Salud Familiar"]
[null,"SERIE BM ESTABLECIMIENTOS AREA MUNICIPAL",{"$nulls":24},"JULIO","Consultorio General Urbano (CGU)"]
[{"$nulls":26},"AGOSTO","Consultorio General Urbano (CGU) - CESFAM"]
[{"$nulls":26},"SEPTIEMBRE","Consultorio General Urbano(CGU) con SAPU/SUR/SAR"]
[{"$nulls":26},"OCTUBRE","Consultorio General Urbano (CGU) - CESFAM con SAPU/SAR"]
[{"$nulls":26},"NOVIEMBRE","Consultorio General Rural (CGR)"]
[{"$nulls":26},"DICIEMBRE","Consultorio General Rural (CGR) - CESFAM"]
[{"$nulls":27},"Consultorio General Rural (CGR) con SAPU/SAR/SUR"]
[{"$nulls":27},"Consultorio General Rural (CGR) - CESFAM con SAPU/SAR/SUR"]
[{"$nulls":27},"Posta de Salud Rural (PSR)"]
[{"$nulls":27},"Centro Comunitario de Salud Familiar (CECOF)"]
[{"$nulls":27},"Consultorio de Salud Mental (COSAM)"]
[{"$nulls":27},"Programa de Reparación y Atención Integral de Salud (PRAIS)"]
[{"$nulls":27},"Centro de Atención Funcionarios (CAF)"]
[{"$nulls":27},"Unidad de Salud de Funcionarios (USF)"]
[{"$nulls":27},"ClÍnica Dental Móvil (CDM)"]
[{"$nulls":27},"Dirección Servicio de Salud (DSS)"]
[{"$nulls":27},"Servicio de Atención Primaria de Urgencia (SAPU)"]
[{"$nulls":27},"Servicio de Urgencia Rural (SUR)"]
[{"$nulls":27},"Servicio de Alta Resolución SAR"]
[{"$nulls":27},"Laboratorio Clínico o Dental"]
[{"$nulls":27},"Servicio de Atención Primaria de Urgencia Dental (SAPUDENT)"]
[{"$nulls":27},"Centro de Rehabilitación (CR)"]
[{"$nulls":27},"Hospital de Campaña"]
[{"$nulls":27},"Centro Oncologico"]
{"$rows_left_out":3}
{"sheet":"BM18","index":2,"n_rows":112,"n_cols":23,"rows_kept":112,"merged":[[7,1,8,6],[9,1,9,3],[10,1,11,3],[10,4,11,4],[10,5,11,5],[10,6,11,6],[12,2,12,3],[13,2,13,3],[14,2,14,3],[15,2,15,3],[16,2,16,3],[17,2,17,3],[18,2,18,3],[19,2,19,3],[20,2,20,3],[21,2,21,3],[22,2,22,3],[23,2,23,3],[24,2,24,3],[25,2,25,3],[26,2,26,3],[27,2,27,3],[28,2,28,3],[29,1,42,1],[29,2,30,2],[31,2,32,2],[33,2,34,2],[35,2,36,2],[37,2,38,2],[39,2,40,2],[41,2,42,2],[43,2,43,3],[46,1,47,1],[46,2,47,2],[46,3,47,3],[46,4,47,4],[61,1,62,2],[61,3,62,3],[61,4,62,4],[61,5,62,5],[63,1,63,2],[70,1,71,1],[70,2,71,2],[70,3,71,3],[70,4,71,4],[79,1,80,1],[79,2,80,2],[83,1,84,1],[83,2,84,2],[83,3,83,8],[89,1,89,2],[90,1,92,1],[94,1,95,1],[94,2,95,2],[94,3,94,5],[94,6,95,6]]}
[null,"SERVICIO DE SALUD "]
[null,{"$f":"CONCATENATE(\"COMUNA: \",NOMBRE!B2,\"  \",\"( \",NOMBRE!C2,NOMBRE!D2,NOMBRE!E2,NOMBRE!F2,NOMBRE!G2,\" )\")","v":"COMUNA:   (  )"}]
[null,{"$f":"CONCATENATE(\"ESTABLECIMIENTO/ESTRATEGIA: \",NOMBRE!B3,\"  \",\"( \",NOMBRE!C3,NOMBRE!D3,NOMBRE!E3,NOMBRE!F3,NOMBRE!G3,NOMBRE!H3,\" )\")","v":"ESTABLECIMIENTO/ESTRATEGIA:   (  )"}]
[null,{"$f":"CONCATENATE(\"MES: \",NOMBRE!B6,\"  \",\"( \",NOMBRE!C6,NOMBRE!D6,\" )\")","v":"MES:   (  )"}]
[null,{"$f":"CONCATENATE(\"AÑO: \",NOMBRE!B7)","v":"AÑO: 2024"}]
[]
[]
[null,"REM-B18.   ACTIVIDADES DE APOYO DIAGNOSTICO Y TERAPEUTICO\n     (USO EXCLUSIVO DE ESTABLECIMIENTOS MUNICIPALES)"]
[]
[null,"SECCIÓN A: EXÁMENES DE DIAGNOSTICO"]
[null,"EXÁMENES",null,null,"TOTAL","SAPU/SAR/SUR","Resto Establecimientos APS"]
[{"$nulls":5},"Total","Total"]
[null,"TOTAL EXÁMENES LABORATORIO",null,null,{"$f":"SUM(F13:G13)","v":{"v":139376,"d":"139,376"}},{"$f":"SUM(F14:F16,F18:F19,F24:F25)","v":{"v":22341,"d":"22,341"}},{"$f":"SUM(G14:G16,G18:G19,G24:G25)","v":{"v":117035,"d":"117,035"}}]
["18010100","I  ","HEMATOLÓGICOS",null,{"$f":"IFERROR(VLOOKUP($A14,Filtro!$A$5:$K$272,2,FALSE),0)","v":{"v":17472,"d":"17,472"}},{"$f":"IFERROR(VLOOKUP($A14,Filtro!$A$5:$K$272,3,FALSE),0)","v":0},{"$f":"IFERROR(VLOOKUP($A14,Filtro!$A$5:$K$272,4,FALSE),0)","v":{"v":17472,"d":"17,472"}}]
["18010200","II  ","BIOQUÍMICOS",null,{"$f":"IFERROR(VLOOKUP($A15,Filtro!$A$5:$K$272,2,FALSE),0)","v":{"v":61089,"d":"61,089"}},{"$f":"IFERROR(VLOOKUP($A15,Filtro!$A$5:$K$272,3,FALSE),0)","v":447},{"$f":"IFERROR(VLOOKUP($A15,Filtro!$A$5:$K$272,4,FALSE),0)","v":{"v":60642,"d":"60,642"}}]
["18090100","III","HORMONALES",null,{"$f":"IFERROR(VLOOKUP($A16,Filtro!$A$5:$K$272,2,FALSE),0)","v":{"v":12167,"d":"12,167"}},{"$f":"IFERROR(VLOOKUP($A16,Filtro!$A$5:$K$272,3,FALSE),0)","v":0},{"$f":"IFERROR(VLOOKUP($A16,Filtro!$A$5:$K$272,4,FALSE),0)","v":{"v":12167,"d":"12,167"}}]
[null,"IV","GENÉTICA"]
["18010500","V","INMUNOLÓGICOS",null,{"$f":"IFERROR(VLOOKUP($A18,Filtro!$A$5:$K$272,2,FALSE),0)","v":579},{"$f":"IFERROR(VLOOKUP($A18,Filtro!$A$5:$K$272,3,FALSE),0)","v":0},{"$f":"IFERROR(VLOOKUP($A18,Filtro!$A$5:$K$272,4,FALSE),0)","v":579}]
["18010601","VI  ","MICROBIOLÓGICOS",null,{"$f":"IFERROR(VLOOKUP($A19,Filtro!$A$5:$K$272,2,FALSE),0)","v":{"v":4281,"d":"4,281"}},{"$f":"IFERROR(VLOOKUP($A19,Filtro!$A$5:$K$272,3,FALSE),0)","v":0},{"$f":"IFERROR(VLOOKUP($A19,Filtro!$A$5:$K$272,4,FALSE),0)","v":{"v":4281,"d":"4,281"}}]
[null,null,"a)   BACTERIAS Y HONGOS"]
[null,null,"b)   PARÁSITOS"]
[null,null,"c)   VIRUS"]
[null,"VII","PROCEDIMIENTO O DETERMINACIÓN DIRECTA C/PACIENTE"]
["18010800","VIII  ","EX.  DE DEPOSICIONES EXUDADOS. SECREC. Y OTROS LIQ.  ",null,{"$f":"IFERROR(VLOOKUP($A24,Filtro!$A$5:$K$272,2,FALSE),0)","v":615},{"$f":"IFERROR(VLOOKUP($A24,Filtro!$A$5:$K$272,2,FALSE),0)","v":615},{"$f":"IFERROR(VLOOKUP($A24,Filtro!$A$5:$K$272,2,FALSE),0)","v":615}]
["18010900","IX   ","ORINA",null,{"$f":"IFERROR(VLOOKUP($A25,Filtro!$A$5:$K$272,2,FALSE),0)","v":{"v":21279,"d":"21,279"}},{"$f":"IFERROR(VLOOKUP($A25,Filtro!$A$5:$K$272,2,FALSE),0)","v":{"v":21279,"d":"21,279"}},{"$f":"IFERROR(VLOOKUP($A25,Filtro!$A$5:$K$272,2,FALSE),0)","v":{"v":21279,"d":"21,279"}}]
[null,"TOTAL EXÁMENES IMAGENOLOGIA",null,null,{"$f":"SUM(F26:G26)","v":{"v":9564,"d":"9,564"}},{"$f":"SUM(F27+F28+F44)","v":{"v":8363,"d":"8,363"}},{"$f":"SUM(G27+G28)","v":{"v":1201,"d":"1,201"}}]
["18011001","a)","EX. RADIOLÓGICOS SIMPLES",null,{"$f":"IFERROR(VLOOKUP($A27,Filtro!$A$5:$K$272,2,FALSE),0)","v":{"v":9050,"d":"9,050"}},{"$f":"IFERROR(VLOOKUP($A27,Filtro!$A$5:$K$272,3,FALSE),0)","v":{"v":8363,"d":"8,363"}},{"$f":"IFERROR(VLOOKUP($A27,Filtro!$A$5:$K$272,4,FALSE),0)","v":687}]
["18011002",null," Ecotomografías",null,{"$f":"IFERROR(VLOOKUP($A28,Filtro!$A$5:$K$272,2,FALSE),0)","v":514},{"$f":"IFERROR(VLOOKUP($A28,Filtro!$A$5:$K$272,3,FALSE),0)","v":0},{"$f":"IFERROR(VLOOKUP($A28,Filtro!$A$5:$K$272,4,FALSE),0)","v":514}]
["18400500",null," Ecotomografías abdominal ",null,{"$f":"IFERROR(VLOOKUP($A29,Filtro!$A$5:$K$272,2,FALSE),0)","v":208},{"$f":"IFERROR(VLOOKUP($A29,Filtro!$A$5:$K$272,3,FALSE),0)","v":0},{"$f":"IFERROR(VLOOKUP($A29,Filtro!$A$5:$K$272,4,FALSE),0)","v":208}]
["18700240",null,"Ecografías Obstétrica Primer Trimestre (<11 semanas)","Médico/a",{"$f":"IFERROR(VLOOKUP($A30,Filtro!$A$5:$K$272,2,FALSE),0)","v":6},{"$f":"IFERROR(VLOOKUP($A30,Filtro!$A$5:$K$272,3,FALSE),0)","v":0},{"$f":"IFERROR(VLOOKUP($A30,Filtro!$A$5:$K$272,4,FALSE),0)","v":6}]
["18700250",null,null,"Matrón/a",{"$f":"IFERROR(VLOOKUP($A31,Filtro!$A$5:$K$272,2,FALSE),0)","v":159},{"$f":"IFERROR(VLOOKUP($A31,Filtro!$A$5:$K$272,3,FALSE),0)","v":0},{"$f":"IFERROR(VLOOKUP($A31,Filtro!$A$5:$K$272,4,FALSE),0)","v":159}]
["18700260",null,"Ecografias Obstétricas Primer Trimestre (11 - 14 semanas)","Médico/a",{"$f":"IFERROR(VLOOKUP($A32,Filtro!$A$5:$K$272,2,FALSE),0)","v":4},{"$f":"IFERROR(VLOOKUP($A32,Filtro!$A$5:$K$272,3,FALSE),0)","v":0},{"$f":"IFERROR(VLOOKUP($A32,Filtro!$A$5:$K$272,4,FALSE),0)","v":4}]
["18700270",null,null,"Matrón/a",{"$f":"IFERROR(VLOOKUP($A33,Filtro!$A$5:$K$272,2,FALSE),0)","v":164},{"$f":"IFERROR(VLOOKUP($A33,Filtro!$A$5:$K$272,3,FALSE),0)","v":0},{"$f":"IFERROR(VLOOKUP($A33,Filtro!$A$5:$K$272,4,FALSE),0)","v":164}]
["18700280",null,"Ecografias Obstétricas Segundo Trimestre (22 - 24 semanas)","Médico/a",{"$f":"IFERROR(VLOOKUP($A34,Filtro!$A$5:$K$272,2,FALSE),0)","v":6},{"$f":"IFERROR(VLOOKUP($A34,Filtro!$A$5:$K$272,3,FALSE),0)","v":0},{"$f":"IFERROR(VLOOKUP($A34,Filtro!$A$5:$K$272,4,FALSE),0)","v":6}]
["18700290",null,null,"Matrón/a",{"$f":"IFERROR(VLOOKUP($A35,Filtro!$A$5:$K$272,2,FALSE),0)","v":120},{"$f":"IFERROR(VLOOKUP($A35,Filtro!$A$5:$K$272,3,FALSE),0)","v":0},{"$f":"IFERROR(VLOOKUP($A35,Filtro!$A$5:$K$272,4,FALSE),0)","v":120}]
["18700300",null,"Ecografias Obstétricas Tercer Trimestre (30 - 34 semanas)","Médico/a",{"$f":"IFERROR(VLOOKUP($A36,Filtro!$A$5:$K$272,2,FALSE),0)","v":14},{"$f":"IFERROR(VLOOKUP($A36,Filtro!$A$5:$K$272,3,FALSE),0)","v":0},{"$f":"IFERROR(VLOOKUP($A36,Filtro!$A$5:$K$272,4,FALSE),0)","v":14}]
["18700310",null,null,"Matrón/a",{"$f":"IFERROR(VLOOKUP($A37,Filtro!$A$5:$K$272,2,FALSE),0)","v":124},{"$f":"IFERROR(VLOOKUP($A37,Filtro!$A$5:$K$272,3,FALSE),0)","v":0},{"$f":"IFERROR(VLOOKUP($A37,Filtro!$A$5:$K$272,4,FALSE),0)","v":124}]
[null,null,"Total Ecografías Obstétricas por profesional","Médico/a",{"$f":"IFERROR(VLOOKUP($A38,Filtro!$A$5:$K$272,2,FALSE),0)","v":0},{"$f":"IFERROR(VLOOKUP($A38,Filtro!$A$5:$K$272,3,FALSE),0)","v":0},{"$f":"IFERROR(VLOOKUP($A38,Filtro!$A$5:$K$272,4,FALSE),0)","v":0}]
[{"$nulls":3},"Matrón/a",{"$f":"IFERROR(VLOOKUP($A39,Filtro!$A$5:$K$272,2,FALSE),0)","v":0},{"$f":"IFERROR(VLOOKUP($A39,Filtro!$A$5:$K$272,3,FALSE),0)","v":0},{"$f":"IFERROR(VLOOKUP($A39,Filtro!$A$5:$K$272,4,FALSE),0)","v":0}]
["18700320",null,"Ecografía de seguimiento DIU (Regulación de la Fertilidad)","Médico/a",{"$f":"IFERROR(VLOOKUP($A40,Filtro!$A$5:$K$272,2,FALSE),0)","v":0},{"$f":"IFERROR(VLOOKUP($A40,Filtro!$A$5:$K$272,3,FALSE),0)","v":0},{"$f":"IFERROR(VLOOKUP($A40,Filtro!$A$5:$K$272,4,FALSE),0)","v":0}]
{"$rows_left_out":73}
{"sheet":"BM18A","index":3,"n_rows":631,"n_cols":9,"rows_kept":631,"merged":[[5,1,5,3],[6,1,6,6],[9,1,10,1],[9,2,10,2],[9,3,10,3],[9,4,10,4],[9,5,10,5],[9,6,10,6],[11,1,11,2],[11,3,11,6],[97,1,97,2],[99,1,99,2],[99,3,99,6],[169,1,169,2],[171,1,171,2],[171,3,171,6],[178,1,178,2],[180,1,180,2],[180,3,180,6],[238,1,238,2],[240,1,240,2],[240,3,240,6],[319,1,319,2],[321,1,321,2],[366,1,366,2],[368,1,368,2],[399,1,399,2],[400,1,400,2],[402,1,402,2],[402,3,402,6],[487,1,487,8],[488,1,489,1],[488,2,489,2],[488,3,489,3],[488,4,489,4],[488,5,489,5],[488,6,488,7],[488,8,489,8],[490,1,490,2],[490,3,490,8],[493,1,493,2],[493,3,493,8],[505,1,505,2],[507,1,507,2],[514,1,514,2],[516,1,516,2],[516,3,516,8],[519,1,519,2],[521,1,521,2],[521,3,521,8],[526,1,526,2],[528,1,528,2],[528,3,528,8],[533,1,533,2],[535,1,535,2],[535,3,535,8],[539,1,539,2],[541,1,541,2],[541,3,541,8],[544,1,544,2],[546,1,546,2],[546,3,546,8],[549,1,549,2],[549,3,549,8],[557,1,557,2],[559,1,559,2],[559,3,559,8],[584,1,584,2],[586,1,586,2],[586,3,586,8],[605,1,605,2],[607,3,608,3],[607,4,608,4],[607,5,608,5],[607,6,608,6],[611,1,611,2],[613,1,613,3],[613,4,613,8],[614,1,615,2],[614,3,615,3],[614,4,615,4],[614,5,615,5],[614,6,614,7],[614,8,615,8]]}
[null,"SERVICIO DE SALUD "]
[null,{"$f":"CONCATENATE(\"COMUNA: \",NOMBRE!B2,\"  \",\"( \",NOMBRE!C2,NOMBRE!D2,NOMBRE!E2,NOMBRE!F2,NOMBRE!G2,\" )\")","v":"COMUNA:   (  )"}]
[null,{"$f":"CONCATENATE(\"ESTABLECIMIENTO/ESTRATEGIA: \",NOMBRE!B3,\"  \",\"( \",NOMBRE!C3,NOMBRE!D3,NOMBRE!E3,NOMBRE!F3,NOMBRE!G3,NOMBRE!H3,\" )\")","v":"ESTABLECIMIENTO/ESTRATEGIA:   (  )"}]
[null,{"$f":"CONCATENATE(\"MES: \",NOMBRE!B6,\"  \",\"( \",NOMBRE!C6,NOMBRE!D6,\" )\")","v":"MES:   (  )"}]
[null,{"$f":"CONCATENATE(\"AÑO: \",NOMBRE!B7)","v":"AÑO: 2024"}]
[]
[null,"REM-18A  -  LIBRO DE PRESTACIONES DE APOYO DIAGNOSTICO y TERAPÉUTICO\n(USO EXCLUSIVO DE ESTABLECIMIENTOS MUNICIPALES)"]
[]
[null,"SECCIÓN A: EXÁMENES DE DIAGNOSTICO"]
[null,"CÓDIGOS","EXÁMENES","TOTAL","SAPU/SAR/SUR","Resto Establecimientos APS","Compra de Servicios"]
[]
[null,"SANGRE HEMATOLOGÍA"]
["80301001","0301001","Acidificación del suero, test de Ham",{"$f":"SUM(E13:F13)","v":0},{"$f":"IFERROR(VLOOKUP($A13,Filtro!$A$5:$K$272,3,FALSE),0)","v":0},{"$f":"IFERROR(VLOOKUP($A13,Filtro!$A$5:$K$272,4,FALSE),0)","v":0},{"$f":"IFERROR(VLOOKUP($A13,Filtro!$A$5:$K$272,5,FALSE),0)","v":0}]
["80301002","0301002","Acido fólico o folatos",{"$f":"SUM(E14:F14)","v":0},{"$f":"IFERROR(VLOOKUP($A14,Filtro!$A$5:$K$272,3,FALSE),0)","v":0},{"$f":"IFERROR(VLOOKUP($A14,Filtro!$A$5:$K$272,4,FALSE),0)","v":0},{"$f":"IFERROR(VLOOKUP($A14,Filtro!$A$5:$K$272,5,FALSE),0)","v":1}]
["80301003","0301003","Adenograma, esplenograma, mielograma c/u",{"$f":"SUM(E15:F15)","v":0},{"$f":"IFERROR(VLOOKUP($A15,Filtro!$A$5:$K$272,3,FALSE),0)","v":0},{"$f":"IFERROR(VLOOKUP($A15,Filtro!$A$5:$K$272,4,FALSE),0)","v":0},{"$f":"IFERROR(VLOOKUP($A15,Filtro!$A$5:$K$272,5,FALSE),0)","v":0}]
["80301004","0301004","Adhesividad plaquetaria",0,{"$f":"IFERROR(VLOOKUP($A16,Filtro!$A$5:$K$272,3,FALSE),0)","v":0},{"$f":"IFERROR(VLOOKUP($A16,Filtro!$A$5:$K$272,4,FALSE),0)","v":0},{"$f":"IFERROR(VLOOKUP($A16,Filtro!$A$5:$K$272,5,FALSE),0)","v":0}]
["80301005","0301005","Aglutininas anti Rho",0,{"$f":"IFERROR(VLOOKUP($A17,Filtro!$A$5:$K$272,3,FALSE),0)","v":0},{"$f":"IFERROR(VLOOKUP($A17,Filtro!$A$5:$K$272,4,FALSE),0)","v":0},{"$f":"IFERROR(VLOOKUP($A17,Filtro!$A$5:$K$272,5,FALSE),0)","v":0}]
["80301006","0301006","Agregación plaquetaria",0,{"$f":"IFERROR(VLOOKUP($A18,Filtro!$A$5:$K$272,3,FALSE),0)","v":0},{"$f":"IFERROR(VLOOKUP($A18,Filtro!$A$5:$K$272,4,FALSE),0)","v":0},{"$f":"IFERROR(VLOOKUP($A18,Filtro!$A$5:$K$272,5,FALSE),0)","v":0}]
["80301007","0301007","Anticoagulantes circulantes o anticoagulante lúpico",0,{"$f":"IFERROR(VLOOKUP($A19,Filtro!$A$5:$K$272,3,FALSE),0)","v":0},{"$f":"IFERROR(VLOOKUP($A19,Filtro!$A$5:$K$272,4,FALSE),0)","v":0},{"$f":"IFERROR(VLOOKUP($A19,Filtro!$A$5:$K$272,5,FALSE),0)","v":0}]
["80301008","0301008","Antitrombina III",0,{"$f":"IFERROR(VLOOKUP($A20,Filtro!$A$5:$K$272,3,FALSE),0)","v":0},{"$f":"IFERROR(VLOOKUP($A20,Filtro!$A$5:$K$272,4,FALSE),0)","v":0},{"$f":"IFERROR(VLOOKUP($A20,Filtro!$A$5:$K$272,5,FALSE),0)","v":0}]
["80301009","0301009","Auto-hemólisis test,  con y sin glucosa",0,{"$f":"IFERROR(VLOOKUP($A21,Filtro!$A$5:$K$272,3,FALSE),0)","v":0},{"$f":"IFERROR(VLOOKUP($A21,Filtro!$A$5:$K$272,4,FALSE),0)","v":0},{"$f":"IFERROR(VLOOKUP($A21,Filtro!$A$5:$K$272,5,FALSE),0)","v":0}]
["80301010","0301010","Células del lupus, cada muestra",0,{"$f":"IFERROR(VLOOKUP($A22,Filtro!$A$5:$K$272,3,FALSE),0)","v":0},{"$f":"IFERROR(VLOOKUP($A22,Filtro!$A$5:$K$272,4,FALSE),0)","v":0},{"$f":"IFERROR(VLOOKUP($A22,Filtro!$A$5:$K$272,5,FALSE),0)","v":0}]
["80301011","0301011","Coagulación, tiempo de",1,{"$f":"IFERROR(VLOOKUP($A23,Filtro!$A$5:$K$272,3,FALSE),0)","v":0},{"$f":"IFERROR(VLOOKUP($A23,Filtro!$A$5:$K$272,4,FALSE),0)","v":1},{"$f":"IFERROR(VLOOKUP($A23,Filtro!$A$5:$K$272,5,FALSE),0)","v":56}]
["80301012","0301012","Coágulo,  tiempo de retracción del",0,{"$f":"IFERROR(VLOOKUP($A24,Filtro!$A$5:$K$272,3,FALSE),0)","v":0},{"$f":"IFERROR(VLOOKUP($A24,Filtro!$A$5:$K$272,4,FALSE),0)","v":0},{"$f":"IFERROR(VLOOKUP($A24,Filtro!$A$5:$K$272,5,FALSE),0)","v":0}]
["80301013","0301013","Coágulo, tiempo de lisis del",0,{"$f":"IFERROR(VLOOKUP($A25,Filtro!$A$5:$K$272,3,FALSE),0)","v":0},{"$f":"IFERROR(VLOOKUP($A25,Filtro!$A$5:$K$272,4,FALSE),0)","v":0},{"$f":"IFERROR(VLOOKUP($A25,Filtro!$A$5:$K$272,5,FALSE),0)","v":0}]
["80301014","0301014","Coombs directo, test de",0,{"$f":"IFERROR(VLOOKUP($A26,Filtro!$A$5:$K$272,3,FALSE),0)","v":0},{"$f":"IFERROR(VLOOKUP($A26,Filtro!$A$5:$K$272,4,FALSE),0)","v":0},{"$f":"IFERROR(VLOOKUP($A26,Filtro!$A$5:$K$272,5,FALSE),0)","v":12}]
["80301015","0301015","Coombs indirecto, prueba de",0,{"$f":"IFERROR(VLOOKUP($A27,Filtro!$A$5:$K$272,3,FALSE),0)","v":0},{"$f":"IFERROR(VLOOKUP($A27,Filtro!$A$5:$K$272,4,FALSE),0)","v":0},{"$f":"IFERROR(VLOOKUP($A27,Filtro!$A$5:$K$272,5,FALSE),0)","v":297}]
["80301016","0301016","Cuerpos de Heinz",0,{"$f":"IFERROR(VLOOKUP($A28,Filtro!$A$5:$K$272,3,FALSE),0)","v":0},{"$f":"IFERROR(VLOOKUP($A28,Filtro!$A$5:$K$272,4,FALSE),0)","v":0},{"$f":"IFERROR(VLOOKUP($A28,Filtro!$A$5:$K$272,5,FALSE),0)","v":0}]
["80301017","0301017","Deshidrogenasa glucosa-6-fosfato en eritrocitos",0,{"$f":"IFERROR(VLOOKUP($A29,Filtro!$A$5:$K$272,3,FALSE),0)","v":0},{"$f":"IFERROR(VLOOKUP($A29,Filtro!$A$5:$K$272,4,FALSE),0)","v":0},{"$f":"IFERROR(VLOOKUP($A29,Filtro!$A$5:$K$272,5,FALSE),0)","v":0}]
["80301020","0301020","Euglobulinas, tiempo de lisis de",0,{"$f":"IFERROR(VLOOKUP($A30,Filtro!$A$5:$K$272,3,FALSE),0)","v":0},{"$f":"IFERROR(VLOOKUP($A30,Filtro!$A$5:$K$272,4,FALSE),0)","v":0},{"$f":"IFERROR(VLOOKUP($A30,Filtro!$A$5:$K$272,5,FALSE),0)","v":0}]
["80301021","0301021","Fibrinógeno",0,{"$f":"IFERROR(VLOOKUP($A31,Filtro!$A$5:$K$272,3,FALSE),0)","v":0},{"$f":"IFERROR(VLOOKUP($A31,Filtro!$A$5:$K$272,4,FALSE),0)","v":0},{"$f":"IFERROR(VLOOKUP($A31,Filtro!$A$5:$K$272,5,FALSE),0)","v":0}]
["80301022","0301022","Test de neutralización plaquetaria",0,{"$f":"IFERROR(VLOOKUP($A32,Filtro!$A$5:$K$272,3,FALSE),0)","v":0},{"$f":"IFERROR(VLOOKUP($A32,Filtro!$A$5:$K$272,4,FALSE),0)","v":0},{"$f":"IFERROR(VLOOKUP($A32,Filtro!$A$5:$K$272,5,FALSE),0)","v":0}]
["80301023","0301023","Factor III plaquetario",0,{"$f":"IFERROR(VLOOKUP($A33,Filtro!$A$5:$K$272,3,FALSE),0)","v":0},{"$f":"IFERROR(VLOOKUP($A33,Filtro!$A$5:$K$272,4,FALSE),0)","v":0},{"$f":"IFERROR(VLOOKUP($A33,Filtro!$A$5:$K$272,5,FALSE),0)","v":0}]
["80301024","0301024","Factor V",0,{"$f":"IFERROR(VLOOKUP($A34,Filtro!$A$5:$K$272,3,FALSE),0)","v":0},{"$f":"IFERROR(VLOOKUP($A34,Filtro!$A$5:$K$272,4,FALSE),0)","v":0},{"$f":"IFERROR(VLOOKUP($A34,Filtro!$A$5:$K$272,5,FALSE),0)","v":0}]
["80301025","0301025","Factores VII, VIII, IX, X, XI, XII, XIII, c/u",0,{"$f":"IFERROR(VLOOKUP($A35,Filtro!$A$5:$K$272,3,FALSE),0)","v":0},{"$f":"IFERROR(VLOOKUP($A35,Filtro!$A$5:$K$272,4,FALSE),0)","v":0},{"$f":"IFERROR(VLOOKUP($A35,Filtro!$A$5:$K$272,5,FALSE),0)","v":0}]
["80301026","0301026","Ferritina",0,{"$f":"IFERROR(VLOOKUP($A36,Filtro!$A$5:$K$272,3,FALSE),0)","v":0},{"$f":"IFERROR(VLOOKUP($A36,Filtro!$A$5:$K$272,4,FALSE),0)","v":0},{"$f":"IFERROR(VLOOKUP($A36,Filtro!$A$5:$K$272,5,FALSE),0)","v":0}]
["80301027","0301027","Fibrinógeno, productos de degradación del",0,{"$f":"IFERROR(VLOOKUP($A37,Filtro!$A$5:$K$272,3,FALSE),0)","v":0},{"$f":"IFERROR(VLOOKUP($A37,Filtro!$A$5:$K$272,4,FALSE),0)","v":0},{"$f":"IFERROR(VLOOKUP($A37,Filtro!$A$5:$K$272,5,FALSE),0)","v":0}]
["80301028","0301028","Fierro sérico",0,{"$f":"IFERROR(VLOOKUP($A38,Filtro!$A$5:$K$272,3,FALSE),0)","v":0},{"$f":"IFERROR(VLOOKUP($A38,Filtro!$A$5:$K$272,4,FALSE),0)","v":0},{"$f":"IFERROR(VLOOKUP($A38,Filtro!$A$5:$K$272,5,FALSE),0)","v":0}]
["80301029","0301029","Fierro, capacidad de fijación del (incluye fierro sérico)",0,{"$f":"IFERROR(VLOOKUP($A39,Filtro!$A$5:$K$272,3,FALSE),0)","v":0},{"$f":"IFERROR(VLOOKUP($A39,Filtro!$A$5:$K$272,4,FALSE),0)","v":0},{"$f":"IFERROR(VLOOKUP($A39,Filtro!$A$5:$K$272,5,FALSE),0)","v":0}]
["80301030","0301030","Fierro, cinética del (cada determinación)",0,{"$f":"IFERROR(VLOOKUP($A40,Filtro!$A$5:$K$272,3,FALSE),0)","v":0},{"$f":"IFERROR(VLOOKUP($A40,Filtro!$A$5:$K$272,4,FALSE),0)","v":0},{"$f":"IFERROR(VLOOKUP($A40,Filtro!$A$5:$K$272,5,FALSE),0)","v":0}]
{"$rows_left_out":591}