{"text_format":"3","workbook":"xlsx","n_sheets":4,"sheets":["Filtro","NOMBRE","BM18","BM18A"],"not_rendered":{"macros":1,"defined_names":1,"pivot_tables":1},"read":"whole","date_system":"1900"}

{"sheet":"Filtro","index":0,"n_rows":272,"n_cols":11,"rows_kept":272}
["IdEstablecimiento","(Todas)"]
["Comuna ","(Todas)"]
["Mes","(Todas)"]
[]
["Etiquetas de fila","Suma de Col01","Suma de Col02","Suma de Col03","Suma de Col04","Suma de Col05","Suma de Col06","Suma de Col07","Suma de Col08","Suma de Col09","Suma de Col10"]
["18010100",17472,0,17472]
["18010200",61089,447,60642]
["18010500",579,0,579]
["18010601",4281,0,4281]
["18010800",615,0,615]
["18010900",21279,267,21012]
["18011001",9050,8363,687]
["18011002",514,0,514]
["18020200",27,22,5]
["18020300",2178,1208,970]
["18020400",202,0,202]
["18020500",23205,4767,18438]
["18020600",31,25,6]
["18020700",272,195,77]
["18020800",237,233,4]
["18020900",147,0,147]
["18030000",1088,888,200]
["18040100",883,76,807]
["18040200",194,19,175]
["18050100",17867,3210,14657]
["18050200",452,81,371]
["18050300",117,74,43]
["18050400",1654,62,1592]
["18050500",10353,374,9979]
["18070100",20,7,13]
["18070300",158,66,83,0,1,5,3]
["18090000",5618,367,5251]
["18090100",12167,0,12167]
["18090200",1266,331]
["18400400",61,57,4]
["18400500",208,0,208]
["18400700",135743]
["18400900",1331,228,1103]
["18700100",24,0,21,3]
["18700240",6,null,6]
["18700250",159,null,159]
["18700260",4,null,4]
["18700270",164,null,164]
["18700280",6,null,6]
["18700290",120,null,120]
["18700300",14,null,14]
["18700310",124,null,124]
["18700330",52,null,52]
["18700340",3,null,3]
["18700350",42,null,42]
["80106002",17867,3210,14657,44,16530,192]
["80106005",452,81,371,19,395,0]
["80106006",117,74,43,0,102]
["80106007",148,85,63,12,116]
["80106008",131,66,65,17,83,0]
["80106009",5,4,1,1,4]
["80106010",178,6,172,78,55]
["80106011",3,2,1,null,3]
["80106012",9,9,0,3,6]
["80106013",473,321,152,18,445,0]
["80106014",61257,35692,25565,456,57606,380]
["80106015",10144,8398,1746,10,9120,0]
["80106017",10353,374,9979,10,10232,0]
["80106020",609,424,185,3,545,0]
["80106021",53,15,38,0,50]
["80106022",492,218,274,2,457,0]
["80106023",5618,367,5251,0,5447,0]
["80106024",1654,62,1592,0,1556,0]
["80301002",0,null,null,1]
["80301011",1,null,1,56]
["80301014",0,null,null,12]
["80301015",0,null,null,297]
["80301034",238,null,238,445]
["80301035",0,null,null,478]
["80301036",649,null,649,7002]
["80301038",380,null,380,5702]
["80301041",5282,null,5282,10137]
["80301045",10091,null,10091,12283]
["80301046",0,null,null,337]
["80301059",587,null,587,555]
["80301065",7,null,7,1]
["80301067",34,null,34,5]
["80301075",0,null,null,106]
["80301083",0,null,null,26]
["80301085",183,null,183,297]
["80301086",15,null,15,364]
["80301087",5,null,5,610]
["80301088",0,null,null,2]
["80302005",5273,null,5273,6932]
["80302008",0,null,null,3]
["80302012",24,null,24,146]
["80302013",131,null,131,1383]
["80302015",36,null,36,300]
["80302022",0,null,null,694]
["80302023",7943,null,7943,17178]
["80302024",26,null,26,72]
["80302026",0,null,null,41]
["80302028",3,null,3]
["80302030",50,null,50,369]
["80302032",14930,null,14930,15301]
["80302034",9036,null,9036,11094]
["80302035",0,null,null,30]
["80302040",47,null,47,1341]
["80302042",0,null,null,193]
["80302045",2,null,2,286]
["80302047",11416,447,10969,22408]
["80302048",832,null,832,1953]
["80302050",0,null,null,3]
["80302051",0,null,null,7]
["80302053",0,null,null,2]
["80302054",0,null,null,7]
["80302057",5009,null,5009,7271]
["80302059",189,null,189]
["80302060",171,null,171,618]
["80302063",43,null,43,2931]
["80302064",257,null,257,10873]
["80302065",0,null,null,28]
["80302067",713,null,713,11663]
["80302068",203,null,203,9772]
["80302069",0,null,null,828]
["80302075",2,null,2,303]
["80302076",4753,null,4753,4541]
["80303015",0,null,null,1093]
["80303024",6856,null,6856,13188]
["80303025",0,null,null,11]
["80303026",5117,null,5117,5082]
["80303027",120,null,120,2]
["80303028",74,null,74,3]
["80305004",0,null,null,1]
["80305005",0,null,null,304]
["80305009",0,null,null,1]
["80305012",0,null,null,2]
["80305019",271,null,271,596]
["80305020",2,null,2,85]
["80305030",1,null,1,23]
["80305070",305,null,305,1268]
["80305170",0,null,null,1]
["80306001",0,null,null,34]
["80306002",0,null,null,172]
["80306004",8,null,8]
["80306005",56,null,56]
["80306007",42,null,42,29]
["80306008",56,null,56,11]
["80306011",1973,null,1973,3320]
["80306018",0,null,null,9]
["80306022",0,null,null,1]
["80306026",373,null,373]
["80306038",1142,null,1142,1010]
["80306041",0,null,null,2]
["80306042",174,null,174,2309]
["80306045",0,null,null,2]
["80306047",0,null,null,15]
["80306048",51,null,51,142]
["80306049",0,null,null,20]
["80306051",29,null,29,52]
["80306052",0,null,null,15]
["80306059",49,null,49,1]
["80306061",308,null,308,784]
["80306064",0,null,null,3]
["80306066",0,null,null,5]
["80306075",0,null,null,62]
["80306077",1,null,1,4]
["80306078",0,null,null,223]
["80306079",5,null,5,155]
["80306080",0,null,null,10]
["80306081",0,null,null,10]
["80306117",8,null,8]
["80306169",4,null,4,328]
["80306170",2,null,2]
["80307011",52086,1041,51045,21671]
["80307012",1955,31,1924,469]
["80308001",0,null,null,9]
["80308004",27,null,27,232]
["80308005",18,null,18,25]
["80308010",501,null,501]
["80308018",0,null,null,3]
["80308044",69,null,69,22]
["80309004",0,null,null,185]
["80309008",0,null,null,2]
["80309010",5916,null,5916,6371]
["80309012",0,null,null,47]
["80309013",6019,null,6019,7612]
["80309014",64,34,30,21]
["80309015",0,null,null,2]
["80309016",191,null,191]
["80309022",8777,48,8729,15625]
["80309023",52,50,2,1084]
["80309024",135,135,null,839]
["80309028",125,null,125,1942]
["80401001",3,3]
["80401002",42,42,null,41]
["80401009",140,130,10,53]
["80401010",282,null,282,350]
["80401013",244,244,null,65]
["80401014",17,17,null,1]
["80401028",8,8]
["80401029",3,3]
["80401031",345,345,null,105]
["80401032",378,378,null,74]
["80401033",22,22,null,3]
["80401042",205,205,null,73]
["80401043",2,2,null,1]
["80401045",395,395,null,121]
["80401046",289,289,null,139]
["80401051",446,446,null,201]
["80401052",147,147,null,120]
["80401053",67,67,null,12]
["80401054",2302,2302,null,629]
["80401055",46,46,null,11]
["80401056",5,5,null,5]
["80401058",2,2,null,1]
["80401059",305,305,null,63]
["80401060",1369,1369,null,569]
["80401062",83,83,null,65]
["80401070",1617,1373,244,905]
["80401151",286,135,151,340]
["80404002",380,null,380]
["80404003",208,null,208,324]
["80404006",43,null,43,5]
["80404007",20,null,20]
["80404012",243,null,243,339]
["80500001",168,0,168,0,168,0]
["80500002",138,null,138,0,138]
["80500004",16,null,16,0,16]
["80500006",38,null,38,0,38]
["80500007",133,132,1,1]
["80500008",469,0,469,0,464,0]
["80500009",284,0,284,0,283,0]
["80500011",12811,7701,5110,65,12014,0]
["80500014",183,43,140,58,46,154]
["80500016",201,201,null,0,201,0]
["80500017",627,627,0,0,627,0]
["81201019",2,2,null,null,2]
["81201029",59,55,4,2,57]
["81301025",23,21,2,9,14]
["81301026",3,null,3,null,3]
["81301029",1,1,null,null,1]
["81601110",5,null,5,null,5]
["81601115",197,0,197,0,192,0]
["81602201",6,0,6,6,0,3]
["81602202",7,null,7,7,null,5]
["81602203",4,null,4,4,null,4]
["81602204",4,null,4,4,null,4]
["81602205",2,null,2,2,null,1]
["81602206",4,null,4,2,null,2]
["81602207",2,null,2,2,null,2]
["81602217",19,0,19,19,0,4]
["81602221",287,269,18,143,104,0]
["81602222",610,554,56,226,286,0]
["81602224",29,0,29,29,0,10]
["81602225",42,32,10,41,1,0]
["81602231",38,0,38,23,7,9]
["81602240",23,22,1,7,16]
["81602241",9,9,null,4,5]
["81602242",2,2,null,1,1]
["81701001",13119,3058,10061,0,12760,3440]
["81701009",6091,1166,4925,0,5789,36]
["81707001",564,0,564,0,564,0]
["81707002",273,0,273,0,265,0]
["81707004",25,null,25,0,25]
["81707030",1316,1208,108,25,1251,0]
["81707038",3995,543,3452,0,3914,0]
["81801023",31,25,6,null,31]
["81901019",182,151,31,1,177,0]
["81901022",90,44,46,0,90,0]
["82001015",147,0,147,0,139,0]
["82106004",18,18,null,null,18]
["82106005",117,116,1,null,117]
["82106006",10,9,1,null,10]
["82106007",2,1,1,null,2]
["82107003",90,89,1,null,90]
["Total general",664622,97023,430909,259808,142684,4251,3]

{"sheet":"NOMBRE","index":1,"n_rows":42,"n_cols":33,"rows_kept":42,"hidden":true,"merged":[[0,0,0,1],[0,2,0,6],[1,8,1,13],[2,8,2,13],[8,0,8,1],[13,0,13,1],[16,1,18,1]]}
["DATOS DEL ESTABLECIMIENTO",null,"CÓDIGOS"]
["NOMBRE DE COMUNA",{"$nulls":7},{"$f":"IF(OR(NOMBRE!C2=\"\",NOMBRE!D2=\"\",NOMBRE!E2=\"\",NOMBRE!F2=\"\",NOMBRE!G2=\"\"),\"Falta Cód. Com.\",\"\")","v":"Falta Cód. Com."},{"$nulls":23},{"$f":"IF(I2>\"\",1,0)","v":1}]
["NOMBRE ESTABLECIMIENTO/ESTRATEGIA",{"$nulls":7},{"$f":"IF(OR(NOMBRE!C3=\"\",NOMBRE!D3=\"\",NOMBRE!E3=\"\",NOMBRE!F3=\"\",NOMBRE!G3=\"\",NOMBRE!H3=\"\"),\"Falta Cód. Est.\",\"\")","v":"Falta Cód. Est."},{"$nulls":23},{"$f":"IF(I3>\"\",1,0)","v":1}]
[]
[]
["MES:",{"$nulls":7},{"$f":"IF(OR(NOMBRE!C6=\"\",NOMBRE!D6=\"\"),\"Falta Cód. Mes.\",\"\")","v":"Falta Cód. Mes."},{"$nulls":23},{"$f":"IF(I6>\"\",1,0)","v":1}]
["AÑO:",2024,{"$nulls":30},{"$f":"SUM(AG2:AG6)","v":3}]
[{"$nulls":6}," "]
["Versión 1.0 FEBRERO 2024"]
[]
["Director/a Servicio de Salud o Director/a Establecimiento",{"$nulls":25},"ENERO","Establecimiento de Mayor Complejidad (EMAYC)","SERVICIO DE SALUD"]
["Jefe/a de Estadísticas",{"$nulls":25},"FEBRERO","Establecimiento de Mediana Complejidad (EMEDC)","MUNICIPAL"]
[{"$nulls":26},"MARZO","Establecimiento de Menor Complejidad (EMENC)","OTRA INSTITUCION (Delegado)"]
["MINSAL - DEIS",{"$nulls":25},"ABRIL","Centros de Diagnóstico Terapeutico (CDT)"]
[{"$nulls":26},"MAYO","Centro de Referencia de Salud (CRS)"]
[{"$nulls":26},"JUNIO","Centro de Salud Familiar"]
[null,"SERIE BM ESTABLECIMIENTOS AREA MUNICIPAL",{"$nulls":24},"JULIO","Consultorio General Urbano (CGU)"]
[{"$nulls":26},"AGOSTO","Consultorio General Urbano (CGU) - CESFAM"]
[{"$nulls":26},"SEPTIEMBRE","Consultorio General Urbano(CGU) con SAPU/SUR/SAR"]
[{"$nulls":26},"OCTUBRE","Consultorio General Urbano (CGU) - CESFAM con SAPU/SAR"]
[{"$nulls":26},"NOVIEMBRE","Consultorio General Rural (CGR)"]
[{"$nulls":26},"DICIEMBRE","Consultorio General Rural (CGR) - CESFAM"]
[{"$nulls":27},"Consultorio General Rural (CGR) con SAPU/SAR/SUR"]
[{"$nulls":27},"Consultorio General Rural (CGR) - CESFAM con SAPU/SAR/SUR"]
[{"$nulls":27},"Posta de Salud Rural (PSR)"]
[{"$nulls":27},"Centro Comunitario de Salud Familiar (CECOF)"]
[{"$nulls":27},"Consultorio de Salud Mental (COSAM)"]
[{"$nulls":27},"Programa de Reparación y Atención Integral de Salud (PRAIS)"]
[{"$nulls":27},"Centro de Atención Funcionarios (CAF)"]
[{"$nulls":27},"Unidad de Salud de Funcionarios (USF)"]
[{"$nulls":27},"ClÍnica Dental Móvil (CDM)"]
[{"$nulls":27},"Dirección Servicio de Salud (DSS)"]
[{"$nulls":27},"Servicio de Atención Primaria de Urgencia (SAPU)"]
[{"$nulls":27},"Servicio de Urgencia Rural (SUR)"]
[{"$nulls":27},"Servicio de Alta Resolución SAR"]
[{"$nulls":27},"Laboratorio Clínico o Dental"]
[{"$nulls":27},"Servicio de Atención Primaria de Urgencia Dental (SAPUDENT)"]
[{"$nulls":27},"Centro de Rehabilitación (CR)"]
[{"$nulls":27},"Hospital de Campaña"]
[{"$nulls":27},"Centro Oncologico"]
[{"$nulls":27},"SAMU"]
[{"$nulls":27},"Centro de salud Urbano (CSU)"]

{"sheet":"BM18","index":2,"n_rows":112,"n_cols":23,"rows_kept":112,"merged":[[7,1,8,6],[9,1,9,3],[10,1,11,3],[10,4,11,4],[10,5,11,5],[10,6,11,6],[12,2,12,3],[13,2,13,3],[14,2,14,3],[15,2,15,3],[16,2,16,3],[17,2,17,3],[18,2,18,3],[19,2,19,3],[20,2,20,3],[21,2,21,3],[22,2,22,3],[23,2,23,3],[24,2,24,3],[25,2,25,3],[26,2,26,3],[27,2,27,3],[28,2,28,3],[29,1,42,1],[29,2,30,2],[31,2,32,2],[33,2,34,2],[35,2,36,2],[37,2,38,2],[39,2,40,2],[41,2,42,2],[43,2,43,3],[46,1,47,1],[46,2,47,2],[46,3,47,3],[46,4,47,4],[61,1,62,2],[61,3,62,3],[61,4,62,4],[61,5,62,5],[63,1,63,2],[70,1,71,1],[70,2,71,2],[70,3,71,3],[70,4,71,4],[79,1,80,1],[79,2,80,2],[83,1,84,1],[83,2,84,2],[83,3,83,8],[89,1,89,2],[90,1,92,1],[94,1,95,1],[94,2,95,2],[94,3,94,5],[94,6,95,6]]}
[null,"SERVICIO DE SALUD "]
[null,{"$f":"CONCATENATE(\"COMUNA: \",NOMBRE!B2,\"  \",\"( \",NOMBRE!C2,NOMBRE!D2,NOMBRE!E2,NOMBRE!F2,NOMBRE!G2,\" )\")","v":"COMUNA:   (  )"}]
[null,{"$f":"CONCATENATE(\"ESTABLECIMIENTO/ESTRATEGIA: \",NOMBRE!B3,\"  \",\"( \",NOMBRE!C3,NOMBRE!D3,NOMBRE!E3,NOMBRE!F3,NOMBRE!G3,NOMBRE!H3,\" )\")","v":"ESTABLECIMIENTO/ESTRATEGIA:   (  )"}]
[null,{"$f":"CONCATENATE(\"MES: \",NOMBRE!B6,\"  \",\"( \",NOMBRE!C6,NOMBRE!D6,\" )\")","v":"MES:   (  )"}]
[null,{"$f":"CONCATENATE(\"AÑO: \",NOMBRE!B7)","v":"AÑO: 2024"}]
[]
[]
[null,"REM-B18.   ACTIVIDADES DE APOYO DIAGNOSTICO Y TERAPEUTICO\n     (USO EXCLUSIVO DE ESTABLECIMIENTOS MUNICIPALES)"]
[]
[null,"SECCIÓN A: EXÁMENES DE DIAGNOSTICO"]
[null,"EXÁMENES",null,null,"TOTAL","SAPU/SAR/SUR","Resto Establecimientos APS"]
[{"$nulls":5},"Total","Total"]
[null,"TOTAL EXÁMENES LABORATORIO",null,null,{"$f":"SUM(F13:G13)","v":{"v":139376,"d":"139,376"}},{"$f":"SUM(F14:F16,F18:F19,F24:F25)","v":{"v":22341,"d":"22,341"}},{"$f":"SUM(G14:G16,G18:G19,G24:G25)","v":{"v":117035,"d":"117,035"}}]
["18010100","I  ","HEMATOLÓGICOS",null,{"$f":"IFERROR(VLOOKUP($A14,Filtro!$A$5:$K$272,2,FALSE),0)","v":{"v":17472,"d":"17,472"}},{"$f":"IFERROR(VLOOKUP($A14,Filtro!$A$5:$K$272,3,FALSE),0)","v":0},{"$f":"IFERROR(VLOOKUP($A14,Filtro!$A$5:$K$272,4,FALSE),0)","v":{"v":17472,"d":"17,472"}}]
["18010200","II  ","BIOQUÍMICOS",null,{"$f":"IFERROR(VLOOKUP($A15,Filtro!$A$5:$K$272,2,FALSE),0)","v":{"v":61089,"d":"61,089"}},{"$f":"IFERROR(VLOOKUP($A15,Filtro!$A$5:$K$272,3,FALSE),0)","v":447},{"$f":"IFERROR(VLOOKUP($A15,Filtro!$A$5:$K$272,4,FALSE),0)","v":{"v":60642,"d":"60,642"}}]
["18090100","III","HORMONALES",null,{"$f":"IFERROR(VLOOKUP($A16,Filtro!$A$5:$K$272,2,FALSE),0)","v":{"v":12167,"d":"12,167"}},{"$f":"IFERROR(VLOOKUP($A16,Filtro!$A$5:$K$272,3,FALSE),0)","v":0},{"$f":"IFERROR(VLOOKUP($A16,Filtro!$A$5:$K$272,4,FALSE),0)","v":{"v":12167,"d":"12,167"}}]
[null,"IV","GENÉTICA"]
["18010500","V","INMUNOLÓGICOS",null,{"$f":"IFERROR(VLOOKUP($A18,Filtro!$A$5:$K$272,2,FALSE),0)","v":579},{"$f":"IFERROR(VLOOKUP($A18,Filtro!$A$5:$K$272,3,FALSE),0)","v":0},{"$f":"IFERROR(VLOOKUP($A18,Filtro!$A$5:$K$272,4,FALSE),0)","v":579}]
["18010601","VI  ","MICROBIOLÓGICOS",null,{"$f":"IFERROR(VLOOKUP($A19,Filtro!$A$5:$K$272,2,FALSE),0)","v":{"v":4281,"d":"4,281"}},{"$f":"IFERROR(VLOOKUP($A19,Filtro!$A$5:$K$272,3,FALSE),0)","v":0},{"$f":"IFERROR(VLOOKUP($A19,Filtro!$A$5:$K$272,4,FALSE),0)","v":{"v":4281,"d":"4,281"}}]
[null,null,"a)   BACTERIAS Y HONGOS"]
[null,null,"b)   PARÁSITOS"]
[null,null,"c)   VIRUS"]
[null,"VII","PROCEDIMIENTO O DETERMINACIÓN DIRECTA C/PACIENTE"]
["18010800","VIII  ","EX.  DE DEPOSICIONES EXUDADOS. SECREC. Y OTROS LIQ.  ",null,{"$f":"IFERROR(VLOOKUP($A24,Filtro!$A$5:$K$272,2,FALSE),0)","v":615},{"$f":"IFERROR(VLOOKUP($A24,Filtro!$A$5:$K$272,2,FALSE),0)","v":615},{"$f":"IFERROR(VLOOKUP($A24,Filtro!$A$5:$K$272,2,FALSE),0)","v":615}]
["18010900","IX   ","ORINA",null,{"$f":"IFERROR(VLOOKUP($A25,Filtro!$A$5:$K$272,2,FALSE),0)","v":{"v":21279,"d":"21,279"}},{"$f":"IFERROR(VLOOKUP($A25,Filtro!$A$5:$K$272,2,FALSE),0)","v":{"v":21279,"d":"21,279"}},{"$f":"IFERROR(VLOOKUP($A25,Filtro!$A$5:$K$272,2,FALSE),0)","v":{"v":21279,"d":"21,279"}}]
[null,"TOTAL EXÁMENES IMAGENOLOGIA",null,null,{"$f":"SUM(F26:G26)","v":{"v":9564,"d":"9,564"}},{"$f":"SUM(F27+F28+F44)","v":{"v":8363,"d":"8,363"}},{"$f":"SUM(G27+G28)","v":{"v":1201,"d":"1,201"}}]
["18011001","a)","EX. RADIOLÓGICOS SIMPLES",null,{"$f":"IFERROR(VLOOKUP($A27,Filtro!$A$5:$K$272,2,FALSE),0)","v":{"v":9050,"d":"9,050"}},{"$f":"IFERROR(VLOOKUP($A27,Filtro!$A$5:$K$272,3,FALSE),0)","v":{"v":8363,"d":"8,363"}},{"$f":"IFERROR(VLOOKUP($A27,Filtro!$A$5:$K$272,4,FALSE),0)","v":687}]
["18011002",null," Ecotomografías",null,{"$f":"IFERROR(VLOOKUP($A28,Filtro!$A$5:$K$272,2,FALSE),0)","v":514},{"$f":"IFERROR(VLOOKUP($A28,Filtro!$A$5:$K$272,3,FALSE),0)","v":0},{"$f":"IFERROR(VLOOKUP($A28,Filtro!$A$5:$K$272,4,FALSE),0)","v":514}]
["18400500",null," Ecotomografías abdominal ",null,{"$f":"IFERROR(VLOOKUP($A29,Filtro!$A$5:$K$272,2,FALSE),0)","v":208},{"$f":"IFERROR(VLOOKUP($A29,Filtro!$A$5:$K$272,3,FALSE),0)","v":0},{"$f":"IFERROR(VLOOKUP($A29,Filtro!$A$5:$K$272,4,FALSE),0)","v":208}]
["18700240",null,"Ecografías Obstétrica Primer Trimestre (<11 semanas)","Médico/a",{"$f":"IFERROR(VLOOKUP($A30,Filtro!$A$5:$K$272,2,FALSE),0)","v":6},{"$f":"IFERROR(VLOOKUP($A30,Filtro!$A$5:$K$272,3,FALSE),0)","v":0},{"$f":"IFERROR(VLOOKUP($A30,Filtro!$A$5:$K$272,4,FALSE),0)","v":6}]
["18700250",null,null,"Matrón/a",{"$f":"IFERROR(VLOOKUP($A31,Filtro!$A$5:$K$272,2,FALSE),0)","v":159},{"$f":"IFERROR(VLOOKUP($A31,Filtro!$A$5:$K$272,3,FALSE),0)","v":0},{"$f":"IFERROR(VLOOKUP($A31,Filtro!$A$5:$K$272,4,FALSE),0)","v":159}]
["18700260",null,"Ecografias Obstétricas Primer Trimestre (11 - 14 semanas)","Médico/a",{"$f":"IFERROR(VLOOKUP($A32,Filtro!$A$5:$K$272,2,FALSE),0)","v":4},{"$f":"IFERROR(VLOOKUP($A32,Filtro!$A$5:$K$272,3,FALSE),0)","v":0},{"$f":"IFERROR(VLOOKUP($A32,Filtro!$A$5:$K$272,4,FALSE),0)","v":4}]
["18700270",null,null,"Matrón/a",{"$f":"IFERROR(VLOOKUP($A33,Filtro!$A$5:$K$272,2,FALSE),0)","v":164},{"$f":"IFERROR(VLOOKUP($A33,Filtro!$A$5:$K$272,3,FALSE),0)","v":0},{"$f":"IFERROR(VLOOKUP($A33,Filtro!$A$5:$K$272,4,FALSE),0)","v":164}]
["18700280",null,"Ecografias Obstétricas Segundo Trimestre (22 - 24 semanas)","Médico/a",{"$f":"IFERROR(VLOOKUP($A34,Filtro!$A$5:$K$272,2,FALSE),0)","v":6},{"$f":"IFERROR(VLOOKUP($A34,Filtro!$A$5:$K$272,3,FALSE),0)","v":0},{"$f":"IFERROR(VLOOKUP($A34,Filtro!$A$5:$K$272,4,FALSE),0)","v":6}]
["18700290",null,null,"Matrón/a",{"$f":"IFERROR(VLOOKUP($A35,Filtro!$A$5:$K$272,2,FALSE),0)","v":120},{"$f":"IFERROR(VLOOKUP($A35,Filtro!$A$5:$K$272,3,FALSE),0)","v":0},{"$f":"IFERROR(VLOOKUP($A35,Filtro!$A$5:$K$272,4,FALSE),0)","v":120}]
["18700300",null,"Ecografias Obstétricas Tercer Trimestre (30 - 34 semanas)","Médico/a",{"$f":"IFERROR(VLOOKUP($A36,Filtro!$A$5:$K$272,2,FALSE),0)","v":14},{"$f":"IFERROR(VLOOKUP($A36,Filtro!$A$5:$K$272,3,FALSE),0)","v":0},{"$f":"IFERROR(VLOOKUP($A36,Filtro!$A$5:$K$272,4,FALSE),0)","v":14}]
["18700310",null,null,"Matrón/a",{"$f":"IFERROR(VLOOKUP($A37,Filtro!$A$5:$K$272,2,FALSE),0)","v":124},{"$f":"IFERROR(VLOOKUP($A37,Filtro!$A$5:$K$272,3,FALSE),0)","v":0},{"$f":"IFERROR(VLOOKUP($A37,Filtro!$A$5:$K$272,4,FALSE),0)","v":124}]
[null,null,"Total Ecografías Obstétricas por profesional","Médico/a",{"$f":"IFERROR(VLOOKUP($A38,Filtro!$A$5:$K$272,2,FALSE),0)","v":0},{"$f":"IFERROR(VLOOKUP($A38,Filtro!$A$5:$K$272,3,FALSE),0)","v":0},{"$f":"IFERROR(VLOOKUP($A38,Filtro!$A$5:$K$272,4,FALSE),0)","v":0}]
[{"$nulls":3},"Matrón/a",{"$f":"IFERROR(VLOOKUP($A39,Filtro!$A$5:$K$272,2,FALSE),0)","v":0},{"$f":"IFERROR(VLOOKUP($A39,Filtro!$A$5:$K$272,3,FALSE),0)","v":0},{"$f":"IFERROR(VLOOKUP($A39,Filtro!$A$5:$K$272,4,FALSE),0)","v":0}]
["18700320",null,"Ecografía de seguimiento DIU (Regulación de la Fertilidad)","Médico/a",{"$f":"IFERROR(VLOOKUP($A40,Filtro!$A$5:$K$272,2,FALSE),0)","v":0},{"$f":"IFERROR(VLOOKUP($A40,Filtro!$A$5:$K$272,3,FALSE),0)","v":0},{"$f":"IFERROR(VLOOKUP($A40,Filtro!$A$5:$K$272,4,FALSE),0)","v":0}]
["18700330",null,null,"Matrón/a",{"$f":"IFERROR(VLOOKUP($A41,Filtro!$A$5:$K$272,2,FALSE),0)","v":52},{"$f":"IFERROR(VLOOKUP($A41,Filtro!$A$5:$K$272,3,FALSE),0)","v":0},{"$f":"IFERROR(VLOOKUP($A41,Filtro!$A$5:$K$272,4,FALSE),0)","v":52}]
["18700340",null,"Ecografía Transvaginal (control de Climaterio y Ginecológico)","Médico/a",{"$f":"IFERROR(VLOOKUP($A42,Filtro!$A$5:$K$272,2,FALSE),0)","v":3},{"$f":"IFERROR(VLOOKUP($A42,Filtro!$A$5:$K$272,3,FALSE),0)","v":0},{"$f":"IFERROR(VLOOKUP($A42,Filtro!$A$5:$K$272,4,FALSE),0)","v":3}]
["18700350",null,null,"Matrón/a",{"$f":"IFERROR(VLOOKUP($A43,Filtro!$A$5:$K$272,2,FALSE),0)","v":42},{"$f":"IFERROR(VLOOKUP($A43,Filtro!$A$5:$K$272,3,FALSE),0)","v":0},{"$f":"IFERROR(VLOOKUP($A43,Filtro!$A$5:$K$272,4,FALSE),0)","v":42}]
[null,null,"Total de ecografías obstetricas y ginecologicas ",null,{"$f":"SUM(E38:E43)","v":97}]
[]
[null,"SECCIÓN B:  PROCEDIMIENTO DE APOYO CLÍNICO Y TERAPÉUTICO"]
[null,"PROCEDIMIENTOS","TOTAL","SAPU/SAR/SUR","Resto Establecimientos APS"]
[{"$nulls":3},"Total","Total"]
["18020100","PROC. DE NEUROLOGÍA ",{"$f":"IFERROR(VLOOKUP($A49,Filtro!A$5:K$272,2,FALSE),0)","v":0},{"$f":"IFERROR(VLOOKUP($A49,Filtro!$A$5:$K$272,3,FALSE),0)","v":0},{"$f":"IFERROR(VLOOKUP($A49,Filtro!$A$5:$K$272,4,FALSE),0)","v":0}]
["18400400","PROC. DE OFTALMOLOGÍA",{"$f":"IFERROR(VLOOKUP($A50,Filtro!A$5:K$272,2,FALSE),0)","v":61},{"$f":"IFERROR(VLOOKUP($A50,Filtro!$A$5:$K$272,3,FALSE),0)","v":57},{"$f":"IFERROR(VLOOKUP($A50,Filtro!$A$5:$K$272,4,FALSE),0)","v":4}]
["18020200","PROC. DE OTORRINOLARINGOLOGÍA ",{"$f":"IFERROR(VLOOKUP($A51,Filtro!A$5:K$272,2,FALSE),0)","v":27},{"$f":"IFERROR(VLOOKUP($A51,Filtro!$A$5:$K$272,3,FALSE),0)","v":22},{"$f":"IFERROR(VLOOKUP($A51,Filtro!$A$5:$K$272,4,FALSE),0)","v":5}]
["18020300","PROC. DE NEUMOLOGÍA",{"$f":"IFERROR(VLOOKUP($A52,Filtro!A$5:K$272,2,FALSE),0)","v":{"v":2178,"d":"2,178"}},{"$f":"IFERROR(VLOOKUP($A52,Filtro!$A$5:$K$272,3,FALSE),0)","v":{"v":1208,"d":"1,208"}},{"$f":"IFERROR(VLOOKUP($A52,Filtro!$A$5:$K$272,4,FALSE),0)","v":970}]
["18020400","PROC. DE DERMATOLOGÍA",{"$f":"IFERROR(VLOOKUP($A53,Filtro!A$5:K$272,2,FALSE),0)","v":202},{"$f":"IFERROR(VLOOKUP($A53,Filtro!$A$5:$K$272,3,FALSE),0)","v":0},{"$f":"IFERROR(VLOOKUP($A53,Filtro!$A$5:$K$272,4,FALSE),0)","v":202}]
["18020500","PROC. DE CARDIOLOGÍA",{"$f":"IFERROR(VLOOKUP($A54,Filtro!A$5:K$272,2,FALSE),0)","v":{"v":23205,"d":"23,205"}},{"$f":"IFERROR(VLOOKUP($A54,Filtro!$A$5:$K$272,3,FALSE),0)","v":{"v":4767,"d":"4,767"}},{"$f":"IFERROR(VLOOKUP($A54,Filtro!$A$5:$K$272,4,FALSE),0)","v":{"v":18438,"d":"18,438"}}]
["18020600","PROC. DE GASTROENTEROLOGÍA",{"$f":"IFERROR(VLOOKUP($A55,Filtro!A$5:K$272,2,FALSE),0)","v":31},{"$f":"IFERROR(VLOOKUP($A55,Filtro!$A$5:$K$272,3,FALSE),0)","v":25},{"$f":"IFERROR(VLOOKUP($A55,Filtro!$A$5:$K$272,4,FALSE),0)","v":6}]
["18020700","PROC. DE UROLOGÍA",{"$f":"IFERROR(VLOOKUP($A56,Filtro!A$5:K$272,2,FALSE),0)","v":272},{"$f":"IFERROR(VLOOKUP($A56,Filtro!$A$5:$K$272,3,FALSE),0)","v":195},{"$f":"IFERROR(VLOOKUP($A56,Filtro!$A$5:$K$272,4,FALSE),0)","v":77}]
["18020800","PROC. ORTOPEDIA Y TRAUMATOLOGÍA",{"$f":"IFERROR(VLOOKUP($A57,Filtro!A$5:K$272,2,FALSE),0)","v":237},{"$f":"IFERROR(VLOOKUP($A57,Filtro!$A$5:$K$272,3,FALSE),0)","v":233},{"$f":"IFERROR(VLOOKUP($A57,Filtro!$A$5:$K$272,4,FALSE),0)","v":4}]
["18020900","PROC. GINECOLOGÍA",{"$f":"IFERROR(VLOOKUP($A58,Filtro!A$5:K$272,2,FALSE),0)","v":147},{"$f":"IFERROR(VLOOKUP($A58,Filtro!$A$5:$K$272,3,FALSE),0)","v":0},{"$f":"IFERROR(VLOOKUP($A58,Filtro!$A$5:$K$272,4,FALSE),0)","v":147}]
[null,"TOTAL",{"$f":"SUM(C49:C58)","v":{"v":26360,"d":"26,360"}},{"$f":"SUM(D49:D58)","v":{"v":6507,"d":"6,507"}},{"$f":"SUM(E49:E58)","v":{"v":19853,"d":"19,853"}}]
[]
[null,"SECCIÓN C:  INTERVENCIONES QUIRÚRGICAS MENORES"]
[{"$nulls":3},"TOTAL","SAPU/SAR/SUR","Resto Establecimientos APS"]
[{"$nulls":4},"Total"]
["18030000","TOTAL INTERVENCIONES QUIRÚRGICAS MENORES (SUB-GRUPO TEGUMENTOS)",null,{"$f":"SUM(E64:F64)","v":{"v":1088,"d":"1,088"}},{"$f":"IFERROR(VLOOKUP($A64,Filtro!$A$5:$K$272,3,FALSE),0)","v":888},{"$f":"IFERROR(VLOOKUP($A64,Filtro!$A$5:$K$272,4,FALSE),0)","v":200}]
[null,"SECCIÓN D : INTERVENCIONES QUIRÚRGICAS MENORES, POR EDAD"]
[null,"INTERVENCIONES QUIRÚRGICAS","TOTAL","< 15 AÑOS","15 Y + AÑOS"]
[null,"TOTAL",{"$f":"SUM(D67:E67)","v":{"v":1077,"d":"1,077"}},{"$f":"SUM(D68:D69)","v":95},{"$f":"SUM(E68:E69)","v":982},{"$f":"V67","v":"El Total de Intervenciones Quirúrgicas de la Sección C debe coincidir con el Total de la Seccion D"},{"$nulls":15},{"$f":"IF(C67=D64,\"\",\"El Total de Intervenciones Quirúrgicas de la Sección C debe coincidir con el Total de la Seccion D\")","v":"El Total de Intervenciones Quirúrgicas de la Sección C debe coincidir con el Total de la Seccion D"},{"$f":"IF(C67=D64,0,1)","v":1}]
["18040100","SAPU/SAR",{"$f":"SUM(D68:E68)","v":883},{"$f":"IFERROR(VLOOKUP($A68,Filtro!$A$5:$K$272,3,FALSE),0)","v":76},{"$f":"IFERROR(VLOOKUP($A68,Filtro!$A$5:$K$272,4,FALSE),0)","v":807},{"$f":"V68","v":"El Total de Intervenciones Quirúrgicas menores SAPU/SAR debe coincidir con el Total de Intervenciones Quirúrgicas menores SAPU/SAR/SUR de la Sección C. "},{"$nulls":15},{"$f":"IF(C68=E64,\"\",\"El Total de Intervenciones Quirúrgicas menores SAPU/SAR debe coincidir con el Total de Intervenciones Quirúrgicas menores SAPU/SAR/SUR de la Sección C. \")","v":"El Total de Intervenciones Quirúrgicas menores SAPU/SAR debe coincidir con el Total de Intervenciones Quirúrgicas menores SAPU/SAR/SUR de la Sección C. "},{"$f":"IF(C67<>BM18A!D585,1,0)","v":1}]
["18040200","RESTO ESTABLECIMIENTOS APS",{"$f":"SUM(D69:E69)","v":194},{"$f":"IFERROR(VLOOKUP($A69,Filtro!$A$5:$K$272,3,FALSE),0)","v":19},{"$f":"IFERROR(VLOOKUP($A69,Filtro!$A$5:$K$272,4,FALSE),0)","v":175}," * El Total de Intervenciones Quirúrgicas menores NO SAPU debe coincidir con el Total de Intervenciones Quirúrgicas menores NO SAPU/NO SUR de la Sección C. ",{"$nulls":15},{"$f":"IF(C69=F64,\"\",\" * El Total de Intervenciones Quirúrgicas menores NO SAPU debe coincidir con el Total de Intervenciones Quirúrgicas menores NO SAPU/NO SUR de la Sección C. \")","v":" * El Total de Intervenciones Quirúrgicas menores NO SAPU debe coincidir con el Total de Intervenciones Quirúrgicas menores NO SAPU/NO SUR de la Sección C. "},{"$f":"IF(C69<>BM18A!E586,1,0)","v":1}]
[null,"SECCIÓN E:  MISCELÁNEOS"]
[null,"MISCELÁNEOS","TOTAL","SAPU/SAR/SUR","Resto Establecimientos APS"]
[{"$nulls":3},"Total","Total"]
["18090000","PROCEDIMIENTOS DE PODOLOGIA",{"$f":"SUM(D73:E73)","v":{"v":5618,"d":"5,618"}},{"$f":"IFERROR(VLOOKUP($A73,Filtro!$A$5:$K$272,3,FALSE),0)","v":367},{"$f":"IFERROR(VLOOKUP($A73,Filtro!$A$5:$K$272,4,FALSE),0)","v":{"v":5251,"d":"5,251"}}]
["18050100","CURACIÓN SIMPLE AMBULATORIA",{"$f":"SUM(D74:E74)","v":{"v":17867,"d":"17,867"}},{"$f":"IFERROR(VLOOKUP($A74,Filtro!$A$5:$K$272,3,FALSE),0)","v":{"v":3210,"d":"3,210"}},{"$f":"IFERROR(VLOOKUP($A74,Filtro!$A$5:$K$272,4,FALSE),0)","v":{"v":14657,"d":"14,657"}}]
["18050400","CURACION AVANZADA UV",{"v":1654,"d":"1,654"},{"$f":"IFERROR(VLOOKUP($A75,Filtro!$A$5:$K$272,3,FALSE),0)","v":62},{"$f":"IFERROR(VLOOKUP($A75,Filtro!$A$5:$K$272,4,FALSE),0)","v":{"v":1592,"d":"1,592"}}]
["18050500","CURACION COMPLEJA",{"v":10353,"d":"10,353"},{"$f":"IFERROR(VLOOKUP($A76,Filtro!$A$5:$K$272,3,FALSE),0)","v":374},{"$f":"IFERROR(VLOOKUP($A76,Filtro!$A$5:$K$272,4,FALSE),0)","v":{"v":9979,"d":"9,979"}}]
["18050200","AUTOCONTROL PERSONAS CON DIABETES INSULINO DEPENDIENTE (D.I.D. MENSUAL)",452,{"$f":"IFERROR(VLOOKUP($A77,Filtro!$A$5:$K$272,3,FALSE),0)","v":81},{"$f":"IFERROR(VLOOKUP($A77,Filtro!$A$5:$K$272,4,FALSE),0)","v":371}]
["18050300","OXIGENOTERAPIA A DOMICILIO",{"$f":"SUM(D78:E78)","v":117},{"$f":"IFERROR(VLOOKUP($A78,Filtro!$A$5:$K$272,3,FALSE),0)","v":74},{"$f":"IFERROR(VLOOKUP($A78,Filtro!$A$5:$K$272,4,FALSE),0)","v":43}]
[null,"SECCIÓN F: PRESCRIPCIONES ADMINISTRADAS EN URGENCIA "]
[null,"ATENCIÓN","TOTAL"]
[]
["18400700","URGENCIA SAPU/SAR/SUR",{"$f":"IFERROR(VLOOKUP($A82,Filtro!$A$5:$K$272,2,FALSE),0)","v":{"v":135743,"d":"135,743"}}]
[null,"SECCIÓN G : OTRAS ATENCIONES A PACIENTES AMBULATORIOS"]
[null,"TIPO DE ATENCIÓN","TOTAL","ATENCIONES POR EDAD"]
[{"$nulls":3},"< 1 año","1 - 4 años","5 a 9 años","10 a 19 años","20 a 64 años","65 años y más"]
["18070100","POR TERAPÉUTICA OCUPACIONAL",{"$f":"SUM(D86:I86)","v":20},{"$f":"IFERROR(VLOOKUP($A86,Filtro!$A$5:$K$272,3,FALSE),0)","v":7},{"$f":"IFERROR(VLOOKUP($A86,Filtro!$A$5:$K$272,4,FALSE),0)","v":13},{"$f":"IFERROR(VLOOKUP($A86,Filtro!$A$5:$K$272,5,FALSE),0)","v":0},{"$f":"IFERROR(VLOOKUP($A86,Filtro!$A$5:$K$272,6,FALSE),0)","v":0},{"$f":"IFERROR(VLOOKUP($A86,Filtro!$A$5:$K$272,7,FALSE),0)","v":0},{"$f":"IFERROR(VLOOKUP($A86,Filtro!$A$5:$K$272,8,FALSE),0)","v":0}]
["18070300","POR KINESIOLOGO (NO SAPU)",{"$f":"SUM(D87:I87)","v":158},{"$f":"IFERROR(VLOOKUP($A87,Filtro!$A$5:$K$272,3,FALSE),0)","v":66},{"$f":"IFERROR(VLOOKUP($A87,Filtro!$A$5:$K$272,4,FALSE),0)","v":83},{"$f":"IFERROR(VLOOKUP($A87,Filtro!$A$5:$K$272,5,FALSE),0)","v":0},{"$f":"IFERROR(VLOOKUP($A87,Filtro!$A$5:$K$272,6,FALSE),0)","v":1},{"$f":"IFERROR(VLOOKUP($A87,Filtro!$A$5:$K$272,7,FALSE),0)","v":5},{"$f":"IFERROR(VLOOKUP($A87,Filtro!$A$5:$K$272,8,FALSE),0)","v":3}]
["18400900","POR EDUCADORA DE PÁRVULO/DIFERENCIAL",{"$f":"SUM(D88:E88)","v":{"v":1331,"d":"1,331"}},{"$f":"IFERROR(VLOOKUP($A88,Filtro!$A$5:$K$272,3,FALSE),0)","v":228},{"$f":"IFERROR(VLOOKUP($A88,Filtro!$A$5:$K$272,4,FALSE),0)","v":{"v":1103,"d":"1,103"}},{"$f":"IFERROR(VLOOKUP($A88,Filtro!$A$5:$K$272,5,FALSE),0)","v":0},{"$f":"IFERROR(VLOOKUP($A88,Filtro!$A$5:$K$272,6,FALSE),0)","v":0},{"$f":"IFERROR(VLOOKUP($A88,Filtro!$A$5:$K$272,7,FALSE),0)","v":0},{"$f":"IFERROR(VLOOKUP($A88,Filtro!$A$5:$K$272,8,FALSE),0)","v":0}]
[null,"SECCIÓN H: OTROS TRASLADOS DE PACIENTES"]
[null,"TIPO DE ACCION",null,"TOTAL        ","POR COMPRA \nDE SERVICIO"]
["18090200","TRASLADOS NO DE URGENCIA","AMBULANCIA",{"$f":"IFERROR(VLOOKUP($A91,Filtro!$A$5:$K$272,2,FALSE),0)","v":{"v":1266,"d":"1,266"}},{"$f":"IFERROR(VLOOKUP($A91,Filtro!$A$5:$K$272,3,FALSE),0)","v":331}]
["18090300",null,"MARÍTIMO",{"$f":"IFERROR(VLOOKUP($A92,Filtro!$A$5:$K$272,2,FALSE),0)","v":0},{"$f":"IFERROR(VLOOKUP($A92,Filtro!$A$5:$K$272,3,FALSE),0)","v":0}]
["18090400",null,"AÉREO",{"$f":"IFERROR(VLOOKUP($A93,Filtro!$A$5:$K$272,2,FALSE),0)","v":0},{"$f":"IFERROR(VLOOKUP($A93,Filtro!$A$5:$K$272,3,FALSE),0)","v":0}]
[null,"SECCIÓN I: EXAMENES PESQUISA COVID-19 "]
[null,"TIPO DE EXÁMEN","TOTAL        ","Por grupos etarios",null,null,"POR COMPRA DE SERVICIO"]
[{"$nulls":3},"< 15 años","> 15-64 años","65 y más años"]
["18700100","0306082: Reacción de Polimerasa en Cadena (P.C.R.), virus Influenza, virus Herpes, citomegalovirus, hepatitis C, mycobacteria TBC, SARS CoV -2 c/u (incluye toma muestra hisopado nasofaríngeo).",{"$f":"SUM(D97:F97)","v":24},{"$f":"IFERROR(VLOOKUP($A97,Filtro!$A$5:$K$272,3,FALSE),0)","v":0},{"$f":"IFERROR(VLOOKUP($A97,Filtro!$A$5:$K$272,4,FALSE),0)","v":21},{"$f":"IFERROR(VLOOKUP($A97,Filtro!$A$5:$K$272,5,FALSE),0)","v":3},{"$f":"IFERROR(VLOOKUP($A97,Filtro!$A$5:$K$272,6,FALSE),0)","v":0}]
[]
[]
["CODIGOS ELIMINADOS"]
[18700110]
[18700120]
[18700130]
[18700140]
[18700150]
[18700160]
[18700170]
[18700180]
[18700190]
[18700210]
[18700220]
[18700230]

{"sheet":"BM18A","index":3,"n_rows":631,"n_cols":9,"rows_kept":631,"merged":[[5,1,5,3],[6,1,6,6],[9,1,10,1],[9,2,10,2],[9,3,10,3],[9,4,10,4],[9,5,10,5],[9,6,10,6],[11,1,11,2],[11,3,11,6],[97,1,97,2],[99,1,99,2],[99,3,99,6],[169,1,169,2],[171,1,171,2],[171,3,171,6],[178,1,178,2],[180,1,180,2],[180,3,180,6],[238,1,238,2],[240,1,240,2],[240,3,240,6],[319,1,319,2],[321,1,321,2],[366,1,366,2],[368,1,368,2],[399,1,399,2],[400,1,400,2],[402,1,402,2],[402,3,402,6],[487,1,487,8],[488,1,489,1],[488,2,489,2],[488,3,489,3],[488,4,489,4],[488,5,489,5],[488,6,488,7],[488,8,489,8],[490,1,490,2],[490,3,490,8],[493,1,493,2],[493,3,493,8],[505,1,505,2],[507,1,507,2],[514,1,514,2],[516,1,516,2],[516,3,516,8],[519,1,519,2],[521,1,521,2],[521,3,521,8],[526,1,526,2],[528,1,528,2],[528,3,528,8],[533,1,533,2],[535,1,535,2],[535,3,535,8],[539,1,539,2],[541,1,541,2],[541,3,541,8],[544,1,544,2],[546,1,546,2],[546,3,546,8],[549,1,549,2],[549,3,549,8],[557,1,557,2],[559,1,559,2],[559,3,559,8],[584,1,584,2],[586,1,586,2],[586,3,586,8],[605,1,605,2],[607,3,608,3],[607,4,608,4],[607,5,608,5],[607,6,608,6],[611,1,611,2],[613,1,613,3],[613,4,613,8],[614,1,615,2],[614,3,615,3],[614,4,615,4],[614,5,615,5],[614,6,614,7],[614,8,615,8]]}
[null,"SERVICIO DE SALUD "]
[null,{"$f":"CONCATENATE(\"COMUNA: \",NOMBRE!B2,\"  \",\"( \",NOMBRE!C2,NOMBRE!D2,NOMBRE!E2,NOMBRE!F2,NOMBRE!G2,\" )\")","v":"COMUNA:   (  )"}]
[null,{"$f":"CONCATENATE(\"ESTABLECIMIENTO/ESTRATEGIA: \",NOMBRE!B3,\"  \",\"( \",NOMBRE!C3,NOMBRE!D3,NOMBRE!E3,NOMBRE!F3,NOMBRE!G3,NOMBRE!H3,\" )\")","v":"ESTABLECIMIENTO/ESTRATEGIA:   (  )"}]
[null,{"$f":"CONCATENATE(\"MES: \",NOMBRE!B6,\"  \",\"( \",NOMBRE!C6,NOMBRE!D6,\" )\")","v":"MES:   (  )"}]
[null,{"$f":"CONCATENATE(\"AÑO: \",NOMBRE!B7)","v":"AÑO: 2024"}]
[]
[null,"REM-18A  -  LIBRO DE PRESTACIONES DE APOYO DIAGNOSTICO y TERAPÉUTICO\n(USO EXCLUSIVO DE ESTABLECIMIENTOS MUNICIPALES)"]
[]
[null,"SECCIÓN A: EXÁMENES DE DIAGNOSTICO"]
[null,"CÓDIGOS","EXÁMENES","TOTAL","SAPU/SAR/SUR","Resto Establecimientos APS","Compra de Servicios"]
[]
[null,"SANGRE HEMATOLOGÍA"]
["80301001","0301001","Acidificación del suero, test de Ham",{"$f":"SUM(E13:F13)","v":0},{"$f":"IFERROR(VLOOKUP($A13,Filtro!$A$5:$K$272,3,FALSE),0)","v":0},{"$f":"IFERROR(VLOOKUP($A13,Filtro!$A$5:$K$272,4,FALSE),0)","v":0},{"$f":"IFERROR(VLOOKUP($A13,Filtro!$A$5:$K$272,5,FALSE),0)","v":0}]
["80301002","0301002","Acido fólico o folatos",{"$f":"SUM(E14:F14)","v":0},{"$f":"IFERROR(VLOOKUP($A14,Filtro!$A$5:$K$272,3,FALSE),0)","v":0},{"$f":"IFERROR(VLOOKUP($A14,Filtro!$A$5:$K$272,4,FALSE),0)","v":0},{"$f":"IFERROR(VLOOKUP($A14,Filtro!$A$5:$K$272,5,FALSE),0)","v":1}]
["80301003","0301003","Adenograma, esplenograma, mielograma c/u",{"$f":"SUM(E15:F15)","v":0},{"$f":"IFERROR(VLOOKUP($A15,Filtro!$A$5:$K$272,3,FALSE),0)","v":0},{"$f":"IFERROR(VLOOKUP($A15,Filtro!$A$5:$K$272,4,FALSE),0)","v":0},{"$f":"IFERROR(VLOOKUP($A15,Filtro!$A$5:$K$272,5,FALSE),0)","v":0}]
["80301004","0301004","Adhesividad plaquetaria",0,{"$f":"IFERROR(VLOOKUP($A16,Filtro!$A$5:$K$272,3,FALSE),0)","v":0},{"$f":"IFERROR(VLOOKUP($A16,Filtro!$A$5:$K$272,4,FALSE),0)","v":0},{"$f":"IFERROR(VLOOKUP($A16,Filtro!$A$5:$K$272,5,FALSE),0)","v":0}]
["80301005","0301005","Aglutininas anti Rho",0,{"$f":"IFERROR(VLOOKUP($A17,Filtro!$A$5:$K$272,3,FALSE),0)","v":0},{"$f":"IFERROR(VLOOKUP($A17,Filtro!$A$5:$K$272,4,FALSE),0)","v":0},{"$f":"IFERROR(VLOOKUP($A17,Filtro!$A$5:$K$272,5,FALSE),0)","v":0}]
["80301006","0301006","Agregación plaquetaria",0,{"$f":"IFERROR(VLOOKUP($A18,Filtro!$A$5:$K$272,3,FALSE),0)","v":0},{"$f":"IFERROR(VLOOKUP($A18,Filtro!$A$5:$K$272,4,FALSE),0)","v":0},{"$f":"IFERROR(VLOOKUP($A18,Filtro!$A$5:$K$272,5,FALSE),0)","v":0}]
["80301007","0301007","Anticoagulantes circulantes o anticoagulante lúpico",0,{"$f":"IFERROR(VLOOKUP($A19,Filtro!$A$5:$K$272,3,FALSE),0)","v":0},{"$f":"IFERROR(VLOOKUP($A19,Filtro!$A$5:$K$272,4,FALSE),0)","v":0},{"$f":"IFERROR(VLOOKUP($A19,Filtro!$A$5:$K$272,5,FALSE),0)","v":0}]
["80301008","0301008","Antitrombina III",0,{"$f":"IFERROR(VLOOKUP($A20,Filtro!$A$5:$K$272,3,FALSE),0)","v":0},{"$f":"IFERROR(VLOOKUP($A20,Filtro!$A$5:$K$272,4,FALSE),0)","v":0},{"$f":"IFERROR(VLOOKUP($A20,Filtro!$A$5:$K$272,5,FALSE),0)","v":0}]
["80301009","0301009","Auto-hemólisis test,  con y sin glucosa",0,{"$f":"IFERROR(VLOOKUP($A21,Filtro!$A$5:$K$272,3,FALSE),0)","v":0},{"$f":"IFERROR(VLOOKUP($A21,Filtro!$A$5:$K$272,4,FALSE),0)","v":0},{"$f":"IFERROR(VLOOKUP($A21,Filtro!$A$5:$K$272,5,FALSE),0)","v":0}]
["80301010","0301010","Células del lupus, cada muestra",0,{"$f":"IFERROR(VLOOKUP($A22,Filtro!$A$5:$K$272,3,FALSE),0)","v":0},{"$f":"IFERROR(VLOOKUP($A22,Filtro!$A$5:$K$272,4,FALSE),0)","v":0},{"$f":"IFERROR(VLOOKUP($A22,Filtro!$A$5:$K$272,5,FALSE),0)","v":0}]
["80301011","0301011","Coagulación, tiempo de",1,{"$f":"IFERROR(VLOOKUP($A23,Filtro!$A$5:$K$272,3,FALSE),0)","v":0},{"$f":"IFERROR(VLOOKUP($A23,Filtro!$A$5:$K$272,4,FALSE),0)","v":1},{"$f":"IFERROR(VLOOKUP($A23,Filtro!$A$5:$K$272,5,FALSE),0)","v":56}]
["80301012","0301012","Coágulo,  tiempo de retracción del",0,{"$f":"IFERROR(VLOOKUP($A24,Filtro!$A$5:$K$272,3,FALSE),0)","v":0},{"$f":"IFERROR(VLOOKUP($A24,Filtro!$A$5:$K$272,4,FALSE),0)","v":0},{"$f":"IFERROR(VLOOKUP($A24,Filtro!$A$5:$K$272,5,FALSE),0)","v":0}]
["80301013","0301013","Coágulo, tiempo de lisis del",0,{"$f":"IFERROR(VLOOKUP($A25,Filtro!$A$5:$K$272,3,FALSE),0)","v":0},{"$f":"IFERROR(VLOOKUP($A25,Filtro!$A$5:$K$272,4,FALSE),0)","v":0},{"$f":"IFERROR(VLOOKUP($A25,Filtro!$A$5:$K$272,5,FALSE),0)","v":0}]
["80301014","0301014","Coombs directo, test de",0,{"$f":"IFERROR(VLOOKUP($A26,Filtro!$A$5:$K$272,3,FALSE),0)","v":0},{"$f":"IFERROR(VLOOKUP($A26,Filtro!$A$5:$K$272,4,FALSE),0)","v":0},{"$f":"IFERROR(VLOOKUP($A26,Filtro!$A$5:$K$272,5,FALSE),0)","v":12}]
["80301015","0301015","Coombs indirecto, prueba de",0,{"$f":"IFERROR(VLOOKUP($A27,Filtro!$A$5:$K$272,3,FALSE),0)","v":0},{"$f":"IFERROR(VLOOKUP($A27,Filtro!$A$5:$K$272,4,FALSE),0)","v":0},{"$f":"IFERROR(VLOOKUP($A27,Filtro!$A$5:$K$272,5,FALSE),0)","v":297}]
["80301016","0301016","Cuerpos de Heinz",0,{"$f":"IFERROR(VLOOKUP($A28,Filtro!$A$5:$K$272,3,FALSE),0)","v":0},{"$f":"IFERROR(VLOOKUP($A28,Filtro!$A$5:$K$272,4,FALSE),0)","v":0},{"$f":"IFERROR(VLOOKUP($A28,Filtro!$A$5:$K$272,5,FALSE),0)","v":0}]
["80301017","0301017","Deshidrogenasa glucosa-6-fosfato en eritrocitos",0,{"$f":"IFERROR(VLOOKUP($A29,Filtro!$A$5:$K$272,3,FALSE),0)","v":0},{"$f":"IFERROR(VLOOKUP($A29,Filtro!$A$5:$K$272,4,FALSE),0)","v":0},{"$f":"IFERROR(VLOOKUP($A29,Filtro!$A$5:$K$272,5,FALSE),0)","v":0}]
["80301020","0301020","Euglobulinas, tiempo de lisis de",0,{"$f":"IFERROR(VLOOKUP($A30,Filtro!$A$5:$K$272,3,FALSE),0)","v":0},{"$f":"IFERROR(VLOOKUP($A30,Filtro!$A$5:$K$272,4,FALSE),0)","v":0},{"$f":"IFERROR(VLOOKUP($A30,Filtro!$A$5:$K$272,5,FALSE),0)","v":0}]
["80301021","0301021","Fibrinógeno",0,{"$f":"IFERROR(VLOOKUP($A31,Filtro!$A$5:$K$272,3,FALSE),0)","v":0},{"$f":"IFERROR(VLOOKUP($A31,Filtro!$A$5:$K$272,4,FALSE),0)","v":0},{"$f":"IFERROR(VLOOKUP($A31,Filtro!$A$5:$K$272,5,FALSE),0)","v":0}]
["80301022","0301022","Test de neutralización plaquetaria",0,{"$f":"IFERROR(VLOOKUP($A32,Filtro!$A$5:$K$272,3,FALSE),0)","v":0},{"$f":"IFERROR(VLOOKUP($A32,Filtro!$A$5:$K$272,4,FALSE),0)","v":0},{"$f":"IFERROR(VLOOKUP($A32,Filtro!$A$5:$K$272,5,FALSE),0)","v":0}]
["80301023","0301023","Factor III plaquetario",0,{"$f":"IFERROR(VLOOKUP($A33,Filtro!$A$5:$K$272,3,FALSE),0)","v":0},{"$f":"IFERROR(VLOOKUP($A33,Filtro!$A$5:$K$272,4,FALSE),0)","v":0},{"$f":"IFERROR(VLOOKUP($A33,Filtro!$A$5:$K$272,5,FALSE),0)","v":0}]
["80301024","0301024","Factor V",0,{"$f":"IFERROR(VLOOKUP($A34,Filtro!$A$5:$K$272,3,FALSE),0)","v":0},{"$f":"IFERROR(VLOOKUP($A34,Filtro!$A$5:$K$272,4,FALSE),0)","v":0},{"$f":"IFERROR(VLOOKUP($A34,Filtro!$A$5:$K$272,5,FALSE),0)","v":0}]
["80301025","0301025","Factores VII, VIII, IX, X, XI, XII, XIII, c/u",0,{"$f":"IFERROR(VLOOKUP($A35,Filtro!$A$5:$K$272,3,FALSE),0)","v":0},{"$f":"IFERROR(VLOOKUP($A35,Filtro!$A$5:$K$272,4,FALSE),0)","v":0},{"$f":"IFERROR(VLOOKUP($A35,Filtro!$A$5:$K$272,5,FALSE),0)","v":0}]
["80301026","0301026","Ferritina",0,{"$f":"IFERROR(VLOOKUP($A36,Filtro!$A$5:$K$272,3,FALSE),0)","v":0},{"$f":"IFERROR(VLOOKUP($A36,Filtro!$A$5:$K$272,4,FALSE),0)","v":0},{"$f":"IFERROR(VLOOKUP($A36,Filtro!$A$5:$K$272,5,FALSE),0)","v":0}]
["80301027","0301027","Fibrinógeno, productos de degradación del",0,{"$f":"IFERROR(VLOOKUP($A37,Filtro!$A$5:$K$272,3,FALSE),0)","v":0},{"$f":"IFERROR(VLOOKUP($A37,Filtro!$A$5:$K$272,4,FALSE),0)","v":0},{"$f":"IFERROR(VLOOKUP($A37,Filtro!$A$5:$K$272,5,FALSE),0)","v":0}]
["80301028","0301028","Fierro sérico",0,{"$f":"IFERROR(VLOOKUP($A38,Filtro!$A$5:$K$272,3,FALSE),0)","v":0},{"$f":"IFERROR(VLOOKUP($A38,Filtro!$A$5:$K$272,4,FALSE),0)","v":0},{"$f":"IFERROR(VLOOKUP($A38,Filtro!$A$5:$K$272,5,FALSE),0)","v":0}]
["80301029","0301029","Fierro, capacidad de fijación del (incluye fierro sérico)",0,{"$f":"IFERROR(VLOOKUP($A39,Filtro!$A$5:$K$272,3,FALSE),0)","v":0},{"$f":"IFERROR(VLOOKUP($A39,Filtro!$A$5:$K$272,4,FALSE),0)","v":0},{"$f":"IFERROR(VLOOKUP($A39,Filtro!$A$5:$K$272,5,FALSE),0)","v":0}]
["80301030","0301030","Fierro, cinética del (cada determinación)",0,{"$f":"IFERROR(VLOOKUP($A40,Filtro!$A$5:$K$272,3,FALSE),0)","v":0},{"$f":"IFERROR(VLOOKUP($A40,Filtro!$A$5:$K$272,4,FALSE),0)","v":0},{"$f":"IFERROR(VLOOKUP($A40,Filtro!$A$5:$K$272,5,FALSE),0)","v":0}]
["80301032","0301032","Gelación por etanol",0,{"$f":"IFERROR(VLOOKUP($A41,Filtro!$A$5:$K$272,3,FALSE),0)","v":0},{"$f":"IFERROR(VLOOKUP($A41,Filtro!$A$5:$K$272,4,FALSE),0)","v":0},{"$f":"IFERROR(VLOOKUP($A41,Filtro!$A$5:$K$272,5,FALSE),0)","v":0}]
["80301033","0301033","Grupos menores. Tipificación o determinación de otros sistemas sanguíneos (Kell, Duffy, Kidd y otros) c/u.",0,{"$f":"IFERROR(VLOOKUP($A42,Filtro!$A$5:$K$272,3,FALSE),0)","v":0},{"$f":"IFERROR(VLOOKUP($A42,Filtro!$A$5:$K$272,4,FALSE),0)","v":0},{"$f":"IFERROR(VLOOKUP($A42,Filtro!$A$5:$K$272,5,FALSE),0)","v":0}]
["80301034","0301034","Grupos sanguíneos AB0 y Rho (incluye estudio de factor Du en Rh negativos)",238,{"$f":"IFERROR(VLOOKUP($A43,Filtro!$A$5:$K$272,3,FALSE),0)","v":0},{"$f":"IFERROR(VLOOKUP($A43,Filtro!$A$5:$K$272,4,FALSE),0)","v":238},{"$f":"IFERROR(VLOOKUP($A43,Filtro!$A$5:$K$272,5,FALSE),0)","v":445}]
["80301035","0301035","Haptoglobina cuantitativa",0,{"$f":"IFERROR(VLOOKUP($A44,Filtro!$A$5:$K$272,3,FALSE),0)","v":0},{"$f":"IFERROR(VLOOKUP($A44,Filtro!$A$5:$K$272,4,FALSE),0)","v":0},{"$f":"IFERROR(VLOOKUP($A44,Filtro!$A$5:$K$272,5,FALSE),0)","v":478}]
["80301036","0301036","Hematocrito (proc. aut.)",649,{"$f":"IFERROR(VLOOKUP($A45,Filtro!$A$5:$K$272,3,FALSE),0)","v":0},{"$f":"IFERROR(VLOOKUP($A45,Filtro!$A$5:$K$272,4,FALSE),0)","v":649},{"$f":"IFERROR(VLOOKUP($A45,Filtro!$A$5:$K$272,5,FALSE),0)","v":{"v":7002,"d":"7,002"}}]
["80301038","0301038","Hemoglobina en sangre total (proc. aut.)",380,{"$f":"IFERROR(VLOOKUP($A46,Filtro!$A$5:$K$272,3,FALSE),0)","v":0},{"$f":"IFERROR(VLOOKUP($A46,Filtro!$A$5:$K$272,4,FALSE),0)","v":380},{"$f":"IFERROR(VLOOKUP($A46,Filtro!$A$5:$K$272,5,FALSE),0)","v":{"v":5702,"d":"5,702"}}]
["80301039","0301039","Hemoglobina fetal cualitativa",0,{"$f":"IFERROR(VLOOKUP($A47,Filtro!$A$5:$K$272,3,FALSE),0)","v":0},{"$f":"IFERROR(VLOOKUP($A47,Filtro!$A$5:$K$272,4,FALSE),0)","v":0},{"$f":"IFERROR(VLOOKUP($A47,Filtro!$A$5:$K$272,5,FALSE),0)","v":0}]
["80301040","0301040","Hemoglobina fetal cuantitativa en eritrocitos",0,{"$f":"IFERROR(VLOOKUP($A48,Filtro!$A$5:$K$272,3,FALSE),0)","v":0},{"$f":"IFERROR(VLOOKUP($A48,Filtro!$A$5:$K$272,4,FALSE),0)","v":0},{"$f":"IFERROR(VLOOKUP($A48,Filtro!$A$5:$K$272,5,FALSE),0)","v":0}]
["80301041","0301041","Hemoglobina glicosilada",{"v":5282,"d":"5,282"},{"$f":"IFERROR(VLOOKUP($A49,Filtro!$A$5:$K$272,3,FALSE),0)","v":0},{"$f":"IFERROR(VLOOKUP($A49,Filtro!$A$5:$K$272,4,FALSE),0)","v":{"v":5282,"d":"5,282"}},{"$f":"IFERROR(VLOOKUP($A49,Filtro!$A$5:$K$272,5,FALSE),0)","v":{"v":10137,"d":"10,137"}}]
["80301042","0301042","Hemoglobina plasmática",0,{"$f":"IFERROR(VLOOKUP($A50,Filtro!$A$5:$K$272,3,FALSE),0)","v":0},{"$f":"IFERROR(VLOOKUP($A50,Filtro!$A$5:$K$272,4,FALSE),0)","v":0},{"$f":"IFERROR(VLOOKUP($A50,Filtro!$A$5:$K$272,5,FALSE),0)","v":0}]
["80301043","0301043","Hemoglobina termolabil",0,{"$f":"IFERROR(VLOOKUP($A51,Filtro!$A$5:$K$272,3,FALSE),0)","v":0},{"$f":"IFERROR(VLOOKUP($A51,Filtro!$A$5:$K$272,4,FALSE),0)","v":0},{"$f":"IFERROR(VLOOKUP($A51,Filtro!$A$5:$K$272,5,FALSE),0)","v":0}]
["80301044","0301044","Hemoglobina, electroforesis de (incluye Hb. total)",0,{"$f":"IFERROR(VLOOKUP($A52,Filtro!$A$5:$K$272,3,FALSE),0)","v":0},{"$f":"IFERROR(VLOOKUP($A52,Filtro!$A$5:$K$272,4,FALSE),0)","v":0},{"$f":"IFERROR(VLOOKUP($A52,Filtro!$A$5:$K$272,5,FALSE),0)","v":0}]
["80301045","0301045","Hemograma (incluye recuentos de leucocitos y eritrocitos, hemoglobina, hematocrito, fórmula leucocitaria, características de los elementos figurados y velocidad de eritrosedimentación)",{"v":10091,"d":"10,091"},{"$f":"IFERROR(VLOOKUP($A53,Filtro!$A$5:$K$272,3,FALSE),0)","v":0},{"$f":"IFERROR(VLOOKUP($A53,Filtro!$A$5:$K$272,4,FALSE),0)","v":{"v":10091,"d":"10,091"}},{"$f":"IFERROR(VLOOKUP($A53,Filtro!$A$5:$K$272,5,FALSE),0)","v":{"v":12283,"d":"12,283"}}]
["80301046","0301046","Hemolisinas",0,{"$f":"IFERROR(VLOOKUP($A54,Filtro!$A$5:$K$272,3,FALSE),0)","v":0},{"$f":"IFERROR(VLOOKUP($A54,Filtro!$A$5:$K$272,4,FALSE),0)","v":0},{"$f":"IFERROR(VLOOKUP($A54,Filtro!$A$5:$K$272,5,FALSE),0)","v":337}]
["80301047","0301047","Hemólisis con sucrosa, test de",0,{"$f":"IFERROR(VLOOKUP($A55,Filtro!$A$5:$K$272,3,FALSE),0)","v":0},{"$f":"IFERROR(VLOOKUP($A55,Filtro!$A$5:$K$272,4,FALSE),0)","v":0},{"$f":"IFERROR(VLOOKUP($A55,Filtro!$A$5:$K$272,5,FALSE),0)","v":0}]
["80301048","0301048","Hemosiderina medular",0,{"$f":"IFERROR(VLOOKUP($A56,Filtro!$A$5:$K$272,3,FALSE),0)","v":0},{"$f":"IFERROR(VLOOKUP($A56,Filtro!$A$5:$K$272,4,FALSE),0)","v":0},{"$f":"IFERROR(VLOOKUP($A56,Filtro!$A$5:$K$272,5,FALSE),0)","v":0}]
["80301049","0301049","Heparina, cuantificación de",0,{"$f":"IFERROR(VLOOKUP($A57,Filtro!$A$5:$K$272,3,FALSE),0)","v":0},{"$f":"IFERROR(VLOOKUP($A57,Filtro!$A$5:$K$272,4,FALSE),0)","v":0},{"$f":"IFERROR(VLOOKUP($A57,Filtro!$A$5:$K$272,5,FALSE),0)","v":0}]
["80301050","0301050","Isoinmunización, detección de anticuerpos irregulares (proc. aut.).",0,{"$f":"IFERROR(VLOOKUP($A58,Filtro!$A$5:$K$272,3,FALSE),0)","v":0},{"$f":"IFERROR(VLOOKUP($A58,Filtro!$A$5:$K$272,4,FALSE),0)","v":0},{"$f":"IFERROR(VLOOKUP($A58,Filtro!$A$5:$K$272,5,FALSE),0)","v":0}]
["80301051","0301051","Isoinmunización, detección e identificación de anticuerpos",0,{"$f":"IFERROR(VLOOKUP($A59,Filtro!$A$5:$K$272,3,FALSE),0)","v":0},{"$f":"IFERROR(VLOOKUP($A59,Filtro!$A$5:$K$272,4,FALSE),0)","v":0},{"$f":"IFERROR(VLOOKUP($A59,Filtro!$A$5:$K$272,5,FALSE),0)","v":0}]
["80301052","0301052","Isopropanol, test de",0,{"$f":"IFERROR(VLOOKUP($A60,Filtro!$A$5:$K$272,3,FALSE),0)","v":0},{"$f":"IFERROR(VLOOKUP($A60,Filtro!$A$5:$K$272,4,FALSE),0)","v":0},{"$f":"IFERROR(VLOOKUP($A60,Filtro!$A$5:$K$272,5,FALSE),0)","v":0}]
["80301053","0301053","Metahemalbúmina",0,{"$f":"IFERROR(VLOOKUP($A61,Filtro!$A$5:$K$272,3,FALSE),0)","v":0},{"$f":"IFERROR(VLOOKUP($A61,Filtro!$A$5:$K$272,4,FALSE),0)","v":0},{"$f":"IFERROR(VLOOKUP($A61,Filtro!$A$5:$K$272,5,FALSE),0)","v":0}]
["80301054","0301054","Metahemoglobina",0,{"$f":"IFERROR(VLOOKUP($A62,Filtro!$A$5:$K$272,3,FALSE),0)","v":0},{"$f":"IFERROR(VLOOKUP($A62,Filtro!$A$5:$K$272,4,FALSE),0)","v":0},{"$f":"IFERROR(VLOOKUP($A62,Filtro!$A$5:$K$272,5,FALSE),0)","v":0}]
["80301055","0301055","Muraminidasa en eritrocitos",0,{"$f":"IFERROR(VLOOKUP($A63,Filtro!$A$5:$K$272,3,FALSE),0)","v":0},{"$f":"IFERROR(VLOOKUP($A63,Filtro!$A$5:$K$272,4,FALSE),0)","v":0},{"$f":"IFERROR(VLOOKUP($A63,Filtro!$A$5:$K$272,5,FALSE),0)","v":0}]
["80301056","0301056","Piruvatoquinasa en eritrocitos",0,{"$f":"IFERROR(VLOOKUP($A64,Filtro!$A$5:$K$272,3,FALSE),0)","v":0},{"$f":"IFERROR(VLOOKUP($A64,Filtro!$A$5:$K$272,4,FALSE),0)","v":0},{"$f":"IFERROR(VLOOKUP($A64,Filtro!$A$5:$K$272,5,FALSE),0)","v":0}]
["80301057","0301057","Protamina sulfato, determinación de",0,{"$f":"IFERROR(VLOOKUP($A65,Filtro!$A$5:$K$272,3,FALSE),0)","v":0},{"$f":"IFERROR(VLOOKUP($A65,Filtro!$A$5:$K$272,4,FALSE),0)","v":0},{"$f":"IFERROR(VLOOKUP($A65,Filtro!$A$5:$K$272,5,FALSE),0)","v":0}]
["80301058","0301058","Protoporfirinas en eritrocitos",0,{"$f":"IFERROR(VLOOKUP($A66,Filtro!$A$5:$K$272,3,FALSE),0)","v":0},{"$f":"IFERROR(VLOOKUP($A66,Filtro!$A$5:$K$272,4,FALSE),0)","v":0},{"$f":"IFERROR(VLOOKUP($A66,Filtro!$A$5:$K$272,5,FALSE),0)","v":0}]
["80301059","0301059","Protrombina, tiempo de o consumo de (incluye INR, Relación Internacional Normalizada)",587,{"$f":"IFERROR(VLOOKUP($A67,Filtro!$A$5:$K$272,3,FALSE),0)","v":0},{"$f":"IFERROR(VLOOKUP($A67,Filtro!$A$5:$K$272,4,FALSE),0)","v":587},{"$f":"IFERROR(VLOOKUP($A67,Filtro!$A$5:$K$272,5,FALSE),0)","v":555}]
["80301062","0301062","Recuento de basófilos (absoluto)",0,{"$f":"IFERROR(VLOOKUP($A68,Filtro!$A$5:$K$272,3,FALSE),0)","v":0},{"$f":"IFERROR(VLOOKUP($A68,Filtro!$A$5:$K$272,4,FALSE),0)","v":0},{"$f":"IFERROR(VLOOKUP($A68,Filtro!$A$5:$K$272,5,FALSE),0)","v":0}]
["80301063","0301063","Recuento de eosinófilos (absoluto)",0,{"$f":"IFERROR(VLOOKUP($A69,Filtro!$A$5:$K$272,3,FALSE),0)","v":0},{"$f":"IFERROR(VLOOKUP($A69,Filtro!$A$5:$K$272,4,FALSE),0)","v":0},{"$f":"IFERROR(VLOOKUP($A69,Filtro!$A$5:$K$272,5,FALSE),0)","v":0}]
["80301064","0301064","Recuento de eritrocitos, absoluto (proc. aut.)",0,{"$f":"IFERROR(VLOOKUP($A70,Filtro!$A$5:$K$272,3,FALSE),0)","v":0},{"$f":"IFERROR(VLOOKUP($A70,Filtro!$A$5:$K$272,4,FALSE),0)","v":0},{"$f":"IFERROR(VLOOKUP($A70,Filtro!$A$5:$K$272,5,FALSE),0)","v":0}]
["80301065","0301065","Recuento de leucocitos, absoluto (proc. aut.)",7,{"$f":"IFERROR(VLOOKUP($A71,Filtro!$A$5:$K$272,3,FALSE),0)","v":0},{"$f":"IFERROR(VLOOKUP($A71,Filtro!$A$5:$K$272,4,FALSE),0)","v":7},{"$f":"IFERROR(VLOOKUP($A71,Filtro!$A$5:$K$272,5,FALSE),0)","v":1}]
["80301066","0301066","Recuento de linfocitos (absoluto)",0,{"$f":"IFERROR(VLOOKUP($A72,Filtro!$A$5:$K$272,3,FALSE),0)","v":0},{"$f":"IFERROR(VLOOKUP($A72,Filtro!$A$5:$K$272,4,FALSE),0)","v":0},{"$f":"IFERROR(VLOOKUP($A72,Filtro!$A$5:$K$272,5,FALSE),0)","v":0}]
["80301067","0301067","Recuento de plaquetas (absoluto)",34,{"$f":"IFERROR(VLOOKUP($A73,Filtro!$A$5:$K$272,3,FALSE),0)","v":0},{"$f":"IFERROR(VLOOKUP($A73,Filtro!$A$5:$K$272,4,FALSE),0)","v":34},{"$f":"IFERROR(VLOOKUP($A73,Filtro!$A$5:$K$272,5,FALSE),0)","v":5}]
["80301068","0301068","Recuento de reticulocitos (absoluto o porcentual)",0,{"$f":"IFERROR(VLOOKUP($A74,Filtro!$A$5:$K$272,3,FALSE),0)","v":0},{"$f":"IFERROR(VLOOKUP($A74,Filtro!$A$5:$K$272,4,FALSE),0)","v":0},{"$f":"IFERROR(VLOOKUP($A74,Filtro!$A$5:$K$272,5,FALSE),0)","v":0}]
["80301069","0301069","Recuento diferencial o fórmula leucocitaria (proc. aut.)",0,{"$f":"IFERROR(VLOOKUP($A75,Filtro!$A$5:$K$272,3,FALSE),0)","v":0},{"$f":"IFERROR(VLOOKUP($A75,Filtro!$A$5:$K$272,4,FALSE),0)","v":0},{"$f":"IFERROR(VLOOKUP($A75,Filtro!$A$5:$K$272,5,FALSE),0)","v":0}]
["80301070","0301070","Resistencia globular osmótica",0,{"$f":"IFERROR(VLOOKUP($A76,Filtro!$A$5:$K$272,3,FALSE),0)","v":0},{"$f":"IFERROR(VLOOKUP($A76,Filtro!$A$5:$K$272,4,FALSE),0)","v":0},{"$f":"IFERROR(VLOOKUP($A76,Filtro!$A$5:$K$272,5,FALSE),0)","v":0}]
["80301071","0301071","Sacarosa, prueba de la",0,{"$f":"IFERROR(VLOOKUP($A77,Filtro!$A$5:$K$272,3,FALSE),0)","v":0},{"$f":"IFERROR(VLOOKUP($A77,Filtro!$A$5:$K$272,4,FALSE),0)","v":0},{"$f":"IFERROR(VLOOKUP($A77,Filtro!$A$5:$K$272,5,FALSE),0)","v":0}]
["80301072","0301072","Sangría, tiempo de (Ivy) (no incluye dispositivo asociado )",0,{"$f":"IFERROR(VLOOKUP($A78,Filtro!$A$5:$K$272,3,FALSE),0)","v":0},{"$f":"IFERROR(VLOOKUP($A78,Filtro!$A$5:$K$272,4,FALSE),0)","v":0},{"$f":"IFERROR(VLOOKUP($A78,Filtro!$A$5:$K$272,5,FALSE),0)","v":0}]
["80301074","0301074","Sobrevida del eritrocito (Cr 51 o similar)",{"$f":"SUM(E79:F79)","v":0},{"$f":"IFERROR(VLOOKUP($A79,Filtro!$A$5:$K$272,3,FALSE),0)","v":0},{"$f":"IFERROR(VLOOKUP($A79,Filtro!$A$5:$K$272,4,FALSE),0)","v":0},{"$f":"IFERROR(VLOOKUP($A79,Filtro!$A$5:$K$272,5,FALSE),0)","v":0}]
["80301075","0301075","Subgrupo ABO y Rh fenotipo - genotipo Rh, c/u",0,{"$f":"IFERROR(VLOOKUP($A80,Filtro!$A$5:$K$272,3,FALSE),0)","v":0},{"$f":"IFERROR(VLOOKUP($A80,Filtro!$A$5:$K$272,4,FALSE),0)","v":0},{"$f":"IFERROR(VLOOKUP($A80,Filtro!$A$5:$K$272,5,FALSE),0)","v":106}]
["80301076","0301076","Thorn, prueba de (no incluye ACTH)",0,{"$f":"IFERROR(VLOOKUP($A81,Filtro!$A$5:$K$272,3,FALSE),0)","v":0},{"$f":"IFERROR(VLOOKUP($A81,Filtro!$A$5:$K$272,4,FALSE),0)","v":0},{"$f":"IFERROR(VLOOKUP($A81,Filtro!$A$5:$K$272,5,FALSE),0)","v":0}]
["80301077","0301077","Tinción de estearasa",0,{"$f":"IFERROR(VLOOKUP($A82,Filtro!$A$5:$K$272,3,FALSE),0)","v":0},{"$f":"IFERROR(VLOOKUP($A82,Filtro!$A$5:$K$272,4,FALSE),0)","v":0},{"$f":"IFERROR(VLOOKUP($A82,Filtro!$A$5:$K$272,5,FALSE),0)","v":0}]
["80301078","0301078","Tinción de fosfatasas alcalinas o ácidas",0,{"$f":"IFERROR(VLOOKUP($A83,Filtro!$A$5:$K$272,3,FALSE),0)","v":0},{"$f":"IFERROR(VLOOKUP($A83,Filtro!$A$5:$K$272,4,FALSE),0)","v":0},{"$f":"IFERROR(VLOOKUP($A83,Filtro!$A$5:$K$272,5,FALSE),0)","v":0}]
["80301079","0301079","Tinción de glicógeno o PAS",0,{"$f":"IFERROR(VLOOKUP($A84,Filtro!$A$5:$K$272,3,FALSE),0)","v":0},{"$f":"IFERROR(VLOOKUP($A84,Filtro!$A$5:$K$272,4,FALSE),0)","v":0},{"$f":"IFERROR(VLOOKUP($A84,Filtro!$A$5:$K$272,5,FALSE),0)","v":0}]
["80301080","0301080","Tinción de lípidos",0,{"$f":"IFERROR(VLOOKUP($A85,Filtro!$A$5:$K$272,3,FALSE),0)","v":0},{"$f":"IFERROR(VLOOKUP($A85,Filtro!$A$5:$K$272,4,FALSE),0)","v":0},{"$f":"IFERROR(VLOOKUP($A85,Filtro!$A$5:$K$272,5,FALSE),0)","v":0}]
["80301081","0301081","Tinción de peroxidasas",0,{"$f":"IFERROR(VLOOKUP($A86,Filtro!$A$5:$K$272,3,FALSE),0)","v":0},{"$f":"IFERROR(VLOOKUP($A86,Filtro!$A$5:$K$272,4,FALSE),0)","v":0},{"$f":"IFERROR(VLOOKUP($A86,Filtro!$A$5:$K$272,5,FALSE),0)","v":0}]
["80301082","0301082","Transferrina",0,{"$f":"IFERROR(VLOOKUP($A87,Filtro!$A$5:$K$272,3,FALSE),0)","v":0},{"$f":"IFERROR(VLOOKUP($A87,Filtro!$A$5:$K$272,4,FALSE),0)","v":0},{"$f":"IFERROR(VLOOKUP($A87,Filtro!$A$5:$K$272,5,FALSE),0)","v":0}]
["80301083","0301083","Trombina, tiempo de",0,{"$f":"IFERROR(VLOOKUP($A88,Filtro!$A$5:$K$272,3,FALSE),0)","v":0},{"$f":"IFERROR(VLOOKUP($A88,Filtro!$A$5:$K$272,4,FALSE),0)","v":0},{"$f":"IFERROR(VLOOKUP($A88,Filtro!$A$5:$K$272,5,FALSE),0)","v":26}]
["80301085","0301085","Tromboplastina, tiempo parcial de (TTPA, TTPK o similares)",183,{"$f":"IFERROR(VLOOKUP($A89,Filtro!$A$5:$K$272,3,FALSE),0)","v":0},{"$f":"IFERROR(VLOOKUP($A89,Filtro!$A$5:$K$272,4,FALSE),0)","v":183},{"$f":"IFERROR(VLOOKUP($A89,Filtro!$A$5:$K$272,5,FALSE),0)","v":297}]
["80301086","0301086","Velocidad de eritrosedimentación (proc. aut.)",15,{"$f":"IFERROR(VLOOKUP($A90,Filtro!$A$5:$K$272,3,FALSE),0)","v":0},{"$f":"IFERROR(VLOOKUP($A90,Filtro!$A$5:$K$272,4,FALSE),0)","v":15},{"$f":"IFERROR(VLOOKUP($A90,Filtro!$A$5:$K$272,5,FALSE),0)","v":364}]
["80301087","0301087","Vitamina B12, absorción de (Co 57 o similar)",5,{"$f":"IFERROR(VLOOKUP($A91,Filtro!$A$5:$K$272,3,FALSE),0)","v":0},{"$f":"IFERROR(VLOOKUP($A91,Filtro!$A$5:$K$272,4,FALSE),0)","v":5},{"$f":"IFERROR(VLOOKUP($A91,Filtro!$A$5:$K$272,5,FALSE),0)","v":610}]
["80301088","0301088","Volemia (incluye volumen globular total, volumen plasmático total y volumen sanguíneo total)",0,{"$f":"IFERROR(VLOOKUP($A92,Filtro!$A$5:$K$272,3,FALSE),0)","v":0},{"$f":"IFERROR(VLOOKUP($A92,Filtro!$A$5:$K$272,4,FALSE),0)","v":0},{"$f":"IFERROR(VLOOKUP($A92,Filtro!$A$5:$K$272,5,FALSE),0)","v":2}]
["80301089","0301089","Von Willebrand, Ag de (factor VIII Ag.)",0,{"$f":"IFERROR(VLOOKUP($A93,Filtro!$A$5:$K$272,3,FALSE),0)","v":0},{"$f":"IFERROR(VLOOKUP($A93,Filtro!$A$5:$K$272,4,FALSE),0)","v":0},{"$f":"IFERROR(VLOOKUP($A93,Filtro!$A$5:$K$272,5,FALSE),0)","v":0}]
["80301090","0301090","Cofactor de Ristocetina",0,{"$f":"IFERROR(VLOOKUP($A94,Filtro!$A$5:$K$272,3,FALSE),0)","v":0},{"$f":"IFERROR(VLOOKUP($A94,Filtro!$A$5:$K$272,4,FALSE),0)","v":0},{"$f":"IFERROR(VLOOKUP($A94,Filtro!$A$5:$K$272,5,FALSE),0)","v":0}]
["80301091","0301091","Proteína C",0,{"$f":"IFERROR(VLOOKUP($A95,Filtro!$A$5:$K$272,3,FALSE),0)","v":0},{"$f":"IFERROR(VLOOKUP($A95,Filtro!$A$5:$K$272,4,FALSE),0)","v":0},{"$f":"IFERROR(VLOOKUP($A95,Filtro!$A$5:$K$272,5,FALSE),0)","v":0}]
["80301092","0301092","Proteína S",0,{"$f":"IFERROR(VLOOKUP($A96,Filtro!$A$5:$K$272,3,FALSE),0)","v":0},{"$f":"IFERROR(VLOOKUP($A96,Filtro!$A$5:$K$272,4,FALSE),0)","v":0},{"$f":"IFERROR(VLOOKUP($A96,Filtro!$A$5:$K$272,5,FALSE),0)","v":0}]
["80301093","0301093","Resistencia Proteína C",0,{"$f":"IFERROR(VLOOKUP($A97,Filtro!$A$5:$K$272,3,FALSE),0)","v":0},{"$f":"IFERROR(VLOOKUP($A97,Filtro!$A$5:$K$272,4,FALSE),0)","v":0},{"$f":"IFERROR(VLOOKUP($A97,Filtro!$A$5:$K$272,5,FALSE),0)","v":0}]
[null,"TOTAL",null,{"$f":"SUM(D13:D97)","v":{"v":17472,"d":"17,472"}},{"$f":"SUM(E13:E97)","v":0},{"$f":"SUM(F13:F97)","v":{"v":17472,"d":"17,472"}},{"$f":"SUM(G13:G97)","v":{"v":38716,"d":"38,716"}}]
[]
[null,"SANGRE BIOQUÍMICO"]
["80302001","0302001","Acetona cualitativa",{"$f":"SUM(E101:F101)","v":0},{"$f":"IFERROR(VLOOKUP($A101,Filtro!$A$5:$K$272,3,FALSE),0)","v":0},{"$f":"IFERROR(VLOOKUP($A101,Filtro!$A$5:$K$272,4,FALSE),0)","v":0},{"$f":"IFERROR(VLOOKUP($A101,Filtro!$A$5:$K$272,5,FALSE),0)","v":0}]
["80302002","0302002","Acido cítrico",{"$f":"SUM(E102:F102)","v":0},{"$f":"IFERROR(VLOOKUP($A102,Filtro!$A$5:$K$272,3,FALSE),0)","v":0},{"$f":"IFERROR(VLOOKUP($A102,Filtro!$A$5:$K$272,4,FALSE),0)","v":0},{"$f":"IFERROR(VLOOKUP($A102,Filtro!$A$5:$K$272,5,FALSE),0)","v":0}]
["80302004","0302004","Acido láctico",0,{"$f":"IFERROR(VLOOKUP($A103,Filtro!$A$5:$K$272,3,FALSE),0)","v":0},{"$f":"IFERROR(VLOOKUP($A103,Filtro!$A$5:$K$272,4,FALSE),0)","v":0},{"$f":"IFERROR(VLOOKUP($A103,Filtro!$A$5:$K$272,5,FALSE),0)","v":0}]
["80302005","0302005","Acido úrico, en sangre",{"v":5273,"d":"5,273"},{"$f":"IFERROR(VLOOKUP($A104,Filtro!$A$5:$K$272,3,FALSE),0)","v":0},{"$f":"IFERROR(VLOOKUP($A104,Filtro!$A$5:$K$272,4,FALSE),0)","v":{"v":5273,"d":"5,273"}},{"$f":"IFERROR(VLOOKUP($A104,Filtro!$A$5:$K$272,5,FALSE),0)","v":{"v":6932,"d":"6,932"}}]
["80302006","0302006","Alcohol etílico",0,{"$f":"IFERROR(VLOOKUP($A105,Filtro!$A$5:$K$272,3,FALSE),0)","v":0},{"$f":"IFERROR(VLOOKUP($A105,Filtro!$A$5:$K$272,4,FALSE),0)","v":0},{"$f":"IFERROR(VLOOKUP($A105,Filtro!$A$5:$K$272,5,FALSE),0)","v":0}]
["80302007","0302007","Aldolasa",0,{"$f":"IFERROR(VLOOKUP($A106,Filtro!$A$5:$K$272,3,FALSE),0)","v":0},{"$f":"IFERROR(VLOOKUP($A106,Filtro!$A$5:$K$272,4,FALSE),0)","v":0},{"$f":"IFERROR(VLOOKUP($A106,Filtro!$A$5:$K$272,5,FALSE),0)","v":0}]
["80302008","0302008","Amilasa, en sangre",0,{"$f":"IFERROR(VLOOKUP($A107,Filtro!$A$5:$K$272,3,FALSE),0)","v":0},{"$f":"IFERROR(VLOOKUP($A107,Filtro!$A$5:$K$272,4,FALSE),0)","v":0},{"$f":"IFERROR(VLOOKUP($A107,Filtro!$A$5:$K$272,5,FALSE),0)","v":3}]
["80302009","0302009","Aminoácidos, cualitativo en sangre",0,{"$f":"IFERROR(VLOOKUP($A108,Filtro!$A$5:$K$272,3,FALSE),0)","v":0},{"$f":"IFERROR(VLOOKUP($A108,Filtro!$A$5:$K$272,4,FALSE),0)","v":0},{"$f":"IFERROR(VLOOKUP($A108,Filtro!$A$5:$K$272,5,FALSE),0)","v":0}]
["80302010","0302010","Amonio",0,{"$f":"IFERROR(VLOOKUP($A109,Filtro!$A$5:$K$272,3,FALSE),0)","v":0},{"$f":"IFERROR(VLOOKUP($A109,Filtro!$A$5:$K$272,4,FALSE),0)","v":0},{"$f":"IFERROR(VLOOKUP($A109,Filtro!$A$5:$K$272,5,FALSE),0)","v":0}]
["80302070","0302070","Apolipoproteínas (A1, B u otras)",{"$f":"SUM(E110:F110)","v":0},{"$f":"IFERROR(VLOOKUP($A110,Filtro!$A$5:$K$272,3,FALSE),0)","v":0},{"$f":"IFERROR(VLOOKUP($A110,Filtro!$A$5:$K$272,4,FALSE),0)","v":0},{"$f":"IFERROR(VLOOKUP($A110,Filtro!$A$5:$K$272,5,FALSE),0)","v":0}]
["80302011","0302011","Bicarbonato (proc. aut.)",0,{"$f":"IFERROR(VLOOKUP($A111,Filtro!$A$5:$K$272,3,FALSE),0)","v":0},{"$f":"IFERROR(VLOOKUP($A111,Filtro!$A$5:$K$272,4,FALSE),0)","v":0},{"$f":"IFERROR(VLOOKUP($A111,Filtro!$A$5:$K$272,5,FALSE),0)","v":0}]
["80302012","0302012","Bilirrubina total (proc. aut.)",{"$f":"SUM(E112:F112)","v":24},{"$f":"IFERROR(VLOOKUP($A112,Filtro!$A$5:$K$272,3,FALSE),0)","v":0},{"$f":"IFERROR(VLOOKUP($A112,Filtro!$A$5:$K$272,4,FALSE),0)","v":24},{"$f":"IFERROR(VLOOKUP($A112,Filtro!$A$5:$K$272,5,FALSE),0)","v":146}]
["80302013","0302013","Bilirrubina total y conjugada",131,{"$f":"IFERROR(VLOOKUP($A113,Filtro!$A$5:$K$272,3,FALSE),0)","v":0},{"$f":"IFERROR(VLOOKUP($A113,Filtro!$A$5:$K$272,4,FALSE),0)","v":131},{"$f":"IFERROR(VLOOKUP($A113,Filtro!$A$5:$K$272,5,FALSE),0)","v":{"v":1383,"d":"1,383"}}]
["80302014","0302014","Bromosulftaleína, prueba de (incluye medicamento y tomas de muestra)",0,{"$f":"IFERROR(VLOOKUP($A114,Filtro!$A$5:$K$272,3,FALSE),0)","v":0},{"$f":"IFERROR(VLOOKUP($A114,Filtro!$A$5:$K$272,4,FALSE),0)","v":0},{"$f":"IFERROR(VLOOKUP($A114,Filtro!$A$5:$K$272,5,FALSE),0)","v":0}]
["80302015","0302015","Calcio en sangre",36,{"$f":"IFERROR(VLOOKUP($A115,Filtro!$A$5:$K$272,3,FALSE),0)","v":0},{"$f":"IFERROR(VLOOKUP($A115,Filtro!$A$5:$K$272,4,FALSE),0)","v":36},{"$f":"IFERROR(VLOOKUP($A115,Filtro!$A$5:$K$272,5,FALSE),0)","v":300}]
["80302016","0302016","Calcio iónico, incluye proteínas totales",0,{"$f":"IFERROR(VLOOKUP($A116,Filtro!$A$5:$K$272,3,FALSE),0)","v":0},{"$f":"IFERROR(VLOOKUP($A116,Filtro!$A$5:$K$272,4,FALSE),0)","v":0},{"$f":"IFERROR(VLOOKUP($A116,Filtro!$A$5:$K$272,5,FALSE),0)","v":0}]
["80302017","0302017","Caroteno",0,{"$f":"IFERROR(VLOOKUP($A117,Filtro!$A$5:$K$272,3,FALSE),0)","v":0},{"$f":"IFERROR(VLOOKUP($A117,Filtro!$A$5:$K$272,4,FALSE),0)","v":0},{"$f":"IFERROR(VLOOKUP($A117,Filtro!$A$5:$K$272,5,FALSE),0)","v":0}]
["80302018","0302018","Caroteno, prueba de sobrecarga de (incluye tomas de muestra)",0,{"$f":"IFERROR(VLOOKUP($A118,Filtro!$A$5:$K$272,3,FALSE),0)","v":0},{"$f":"IFERROR(VLOOKUP($A118,Filtro!$A$5:$K$272,4,FALSE),0)","v":0},{"$f":"IFERROR(VLOOKUP($A118,Filtro!$A$5:$K$272,5,FALSE),0)","v":0}]
["80302019","0302019","Ceruloplasmina",0,{"$f":"IFERROR(VLOOKUP($A119,Filtro!$A$5:$K$272,3,FALSE),0)","v":0},{"$f":"IFERROR(VLOOKUP($A119,Filtro!$A$5:$K$272,4,FALSE),0)","v":0},{"$f":"IFERROR(VLOOKUP($A119,Filtro!$A$5:$K$272,5,FALSE),0)","v":0}]
["80302020","0302020","Cobre",0,{"$f":"IFERROR(VLOOKUP($A120,Filtro!$A$5:$K$272,3,FALSE),0)","v":0},{"$f":"IFERROR(VLOOKUP($A120,Filtro!$A$5:$K$272,4,FALSE),0)","v":0},{"$f":"IFERROR(VLOOKUP($A120,Filtro!$A$5:$K$272,5,FALSE),0)","v":0}]
["80302067","0302067","Colesterol total (proc. aut.)",713,{"$f":"IFERROR(VLOOKUP($A121,Filtro!$A$5:$K$272,3,FALSE),0)","v":0},{"$f":"IFERROR(VLOOKUP($A121,Filtro!$A$5:$K$272,4,FALSE),0)","v":713},{"$f":"IFERROR(VLOOKUP($A121,Filtro!$A$5:$K$272,5,FALSE),0)","v":{"v":11663,"d":"11,663"}}]
["80302068","0302068","Colesterol HDL (proc. aut.)",203,{"$f":"IFERROR(VLOOKUP($A122,Filtro!$A$5:$K$272,3,FALSE),0)","v":0},{"$f":"IFERROR(VLOOKUP($A122,Filtro!$A$5:$K$272,4,FALSE),0)","v":203},{"$f":"IFERROR(VLOOKUP($A122,Filtro!$A$5:$K$272,5,FALSE),0)","v":{"v":9772,"d":"9,772"}}]
["80302021","0302021","Colinesterasa en plasma o sangre total",0,{"$f":"IFERROR(VLOOKUP($A123,Filtro!$A$5:$K$272,3,FALSE),0)","v":0},{"$f":"IFERROR(VLOOKUP($A123,Filtro!$A$5:$K$272,4,FALSE),0)","v":0},{"$f":"IFERROR(VLOOKUP($A123,Filtro!$A$5:$K$272,5,FALSE),0)","v":0}]
["80302022","0302022","Creatina",0,{"$f":"IFERROR(VLOOKUP($A124,Filtro!$A$5:$K$272,3,FALSE),0)","v":0},{"$f":"IFERROR(VLOOKUP($A124,Filtro!$A$5:$K$272,4,FALSE),0)","v":0},{"$f":"IFERROR(VLOOKUP($A124,Filtro!$A$5:$K$272,5,FALSE),0)","v":694}]
["80302023","0302023","Creatinina en sangre",{"v":7943,"d":"7,943"},{"$f":"IFERROR(VLOOKUP($A125,Filtro!$A$5:$K$272,3,FALSE),0)","v":0},{"$f":"IFERROR(VLOOKUP($A125,Filtro!$A$5:$K$272,4,FALSE),0)","v":{"v":7943,"d":"7,943"}},{"$f":"IFERROR(VLOOKUP($A125,Filtro!$A$5:$K$272,5,FALSE),0)","v":{"v":17178,"d":"17,178"}}]
["80302024","0302024","Creatinina, depuración de (Clearence) (proc. aut.)",26,{"$f":"IFERROR(VLOOKUP($A126,Filtro!$A$5:$K$272,3,FALSE),0)","v":0},{"$f":"IFERROR(VLOOKUP($A126,Filtro!$A$5:$K$272,4,FALSE),0)","v":26},{"$f":"IFERROR(VLOOKUP($A126,Filtro!$A$5:$K$272,5,FALSE),0)","v":72}]
["80302025","0302025","Creatinquinasa CK - MB  miocárdica",0,{"$f":"IFERROR(VLOOKUP($A127,Filtro!$A$5:$K$272,3,FALSE),0)","v":0},{"$f":"IFERROR(VLOOKUP($A127,Filtro!$A$5:$K$272,4,FALSE),0)","v":0},{"$f":"IFERROR(VLOOKUP($A127,Filtro!$A$5:$K$272,5,FALSE),0)","v":0}]
["80302026","0302026","Creatinquinasa CK - total",0,{"$f":"IFERROR(VLOOKUP($A128,Filtro!$A$5:$K$272,3,FALSE),0)","v":0},{"$f":"IFERROR(VLOOKUP($A128,Filtro!$A$5:$K$272,4,FALSE),0)","v":0},{"$f":"IFERROR(VLOOKUP($A128,Filtro!$A$5:$K$272,5,FALSE),0)","v":41}]
["80302028","0302028","Depuraciones (Clearance) exógenas de Hipurán, Rojo Congo, manitol e inulina, c/u (no incluye medicamento)",3,{"$f":"IFERROR(VLOOKUP($A129,Filtro!$A$5:$K$272,3,FALSE),0)","v":0},{"$f":"IFERROR(VLOOKUP($A129,Filtro!$A$5:$K$272,4,FALSE),0)","v":3},{"$f":"IFERROR(VLOOKUP($A129,Filtro!$A$5:$K$272,5,FALSE),0)","v":0}]
["80302029","0302029","Deshidrogenasa hidroxibutírica (HBDH)",0,{"$f":"IFERROR(VLOOKUP($A130,Filtro!$A$5:$K$272,3,FALSE),0)","v":0},{"$f":"IFERROR(VLOOKUP($A130,Filtro!$A$5:$K$272,4,FALSE),0)","v":0},{"$f":"IFERROR(VLOOKUP($A130,Filtro!$A$5:$K$272,5,FALSE),0)","v":0}]
["80302030","0302030","Deshidrogenasa láctica total (LDH)",50,{"$f":"IFERROR(VLOOKUP($A131,Filtro!$A$5:$K$272,3,FALSE),0)","v":0},{"$f":"IFERROR(VLOOKUP($A131,Filtro!$A$5:$K$272,4,FALSE),0)","v":50},{"$f":"IFERROR(VLOOKUP($A131,Filtro!$A$5:$K$272,5,FALSE),0)","v":369}]
["80302031","0302031","Deshidrogenasa láctica total (LDH), con separación de isoenzimas",0,{"$f":"IFERROR(VLOOKUP($A132,Filtro!$A$5:$K$272,3,FALSE),0)","v":0},{"$f":"IFERROR(VLOOKUP($A132,Filtro!$A$5:$K$272,4,FALSE),0)","v":0},{"$f":"IFERROR(VLOOKUP($A132,Filtro!$A$5:$K$272,5,FALSE),0)","v":0}]
["80302032","0302032","Electrolitos plasmáticos (sodio, potasio, cloro) c/u",{"v":14930,"d":"14,930"},{"$f":"IFERROR(VLOOKUP($A133,Filtro!$A$5:$K$272,3,FALSE),0)","v":0},{"$f":"IFERROR(VLOOKUP($A133,Filtro!$A$5:$K$272,4,FALSE),0)","v":{"v":14930,"d":"14,930"}},{"$f":"IFERROR(VLOOKUP($A133,Filtro!$A$5:$K$272,5,FALSE),0)","v":{"v":15301,"d":"15,301"}}]
["80302033","0302033","Enzima convertidora de angiotensina I",0,{"$f":"IFERROR(VLOOKUP($A134,Filtro!$A$5:$K$272,3,FALSE),0)","v":0},{"$f":"IFERROR(VLOOKUP($A134,Filtro!$A$5:$K$272,4,FALSE),0)","v":0},{"$f":"IFERROR(VLOOKUP($A134,Filtro!$A$5:$K$272,5,FALSE),0)","v":0}]
["80302034","0302034","Perfil Lipídico (incluye: colesterol total, HDL, LDL, VLDL y triglicéridos) ",{"v":9036,"d":"9,036"},{"$f":"IFERROR(VLOOKUP($A135,Filtro!$A$5:$K$272,3,FALSE),0)","v":0},{"$f":"IFERROR(VLOOKUP($A135,Filtro!$A$5:$K$272,4,FALSE),0)","v":{"v":9036,"d":"9,036"}},{"$f":"IFERROR(VLOOKUP($A135,Filtro!$A$5:$K$272,5,FALSE),0)","v":{"v":11094,"d":"11,094"}}]
["80302035","0302035","Fármacos y/o drogas; niveles plasmáticos de (alcohol, anorexígenos, antiarrítmicos, antibióticos, antidepresivos, antiepilépticos, antihistamínicos, antiinflamatorios y analgésicos, estimulantes respiratorios, tranquilizantes mayores y menores, etc.) c/u",0,{"$f":"IFERROR(VLOOKUP($A136,Filtro!$A$5:$K$272,3,FALSE),0)","v":0},{"$f":"IFERROR(VLOOKUP($A136,Filtro!$A$5:$K$272,4,FALSE),0)","v":0},{"$f":"IFERROR(VLOOKUP($A136,Filtro!$A$5:$K$272,5,FALSE),0)","v":30}]
["80302036","0302036","Fenilalanina",0,{"$f":"IFERROR(VLOOKUP($A137,Filtro!$A$5:$K$272,3,FALSE),0)","v":0},{"$f":"IFERROR(VLOOKUP($A137,Filtro!$A$5:$K$272,4,FALSE),0)","v":0},{"$f":"IFERROR(VLOOKUP($A137,Filtro!$A$5:$K$272,5,FALSE),0)","v":0}]
["80302037","0302037","Fosfatasas ácidas totales",0,{"$f":"IFERROR(VLOOKUP($A138,Filtro!$A$5:$K$272,3,FALSE),0)","v":0},{"$f":"IFERROR(VLOOKUP($A138,Filtro!$A$5:$K$272,4,FALSE),0)","v":0},{"$f":"IFERROR(VLOOKUP($A138,Filtro!$A$5:$K$272,5,FALSE),0)","v":0}]
["80302038","0302038","Fosfatasas ácidas totales y fracción prostática",0,{"$f":"IFERROR(VLOOKUP($A139,Filtro!$A$5:$K$272,3,FALSE),0)","v":0},{"$f":"IFERROR(VLOOKUP($A139,Filtro!$A$5:$K$272,4,FALSE),0)","v":0},{"$f":"IFERROR(VLOOKUP($A139,Filtro!$A$5:$K$272,5,FALSE),0)","v":0}]
["80302039","0302039","Fosfatasas alcalinas con separación de isoenzimas hepáticas, intestinales, óseas c/u",0,{"$f":"IFERROR(VLOOKUP($A140,Filtro!$A$5:$K$272,3,FALSE),0)","v":0},{"$f":"IFERROR(VLOOKUP($A140,Filtro!$A$5:$K$272,4,FALSE),0)","v":0},{"$f":"IFERROR(VLOOKUP($A140,Filtro!$A$5:$K$272,5,FALSE),0)","v":0}]
["80302040","0302040","Fosfatasas alcalinas totales",47,{"$f":"IFERROR(VLOOKUP($A141,Filtro!$A$5:$K$272,3,FALSE),0)","v":0},{"$f":"IFERROR(VLOOKUP($A141,Filtro!$A$5:$K$272,4,FALSE),0)","v":47},{"$f":"IFERROR(VLOOKUP($A141,Filtro!$A$5:$K$272,5,FALSE),0)","v":{"v":1341,"d":"1,341"}}]
["80302041","0302041","Fosfolípidos",0,{"$f":"IFERROR(VLOOKUP($A142,Filtro!$A$5:$K$272,3,FALSE),0)","v":0},{"$f":"IFERROR(VLOOKUP($A142,Filtro!$A$5:$K$272,4,FALSE),0)","v":0},{"$f":"IFERROR(VLOOKUP($A142,Filtro!$A$5:$K$272,5,FALSE),0)","v":0}]
["80302042","0302042","Fósforo (fosfatos) en sangre",0,{"$f":"IFERROR(VLOOKUP($A143,Filtro!$A$5:$K$272,3,FALSE),0)","v":0},{"$f":"IFERROR(VLOOKUP($A143,Filtro!$A$5:$K$272,4,FALSE),0)","v":0},{"$f":"IFERROR(VLOOKUP($A143,Filtro!$A$5:$K$272,5,FALSE),0)","v":193}]
["80302043","0302043","Galactosa",0,{"$f":"IFERROR(VLOOKUP($A144,Filtro!$A$5:$K$272,3,FALSE),0)","v":0},{"$f":"IFERROR(VLOOKUP($A144,Filtro!$A$5:$K$272,4,FALSE),0)","v":0},{"$f":"IFERROR(VLOOKUP($A144,Filtro!$A$5:$K$272,5,FALSE),0)","v":0}]
["80302044","0302044","Galactosa, curva de tolerancia, (mínimo cuatro determinaciones) (no incluye la galactosa que se administra) (incluye los valores de todas las tomas de muestras necesarias)",0,{"$f":"IFERROR(VLOOKUP($A145,Filtro!$A$5:$K$272,3,FALSE),0)","v":0},{"$f":"IFERROR(VLOOKUP($A145,Filtro!$A$5:$K$272,4,FALSE),0)","v":0},{"$f":"IFERROR(VLOOKUP($A145,Filtro!$A$5:$K$272,5,FALSE),0)","v":0}]
["80302045","0302045","Gamma glutamiltranspeptidasa (GGT)",2,{"$f":"IFERROR(VLOOKUP($A146,Filtro!$A$5:$K$272,3,FALSE),0)","v":0},{"$f":"IFERROR(VLOOKUP($A146,Filtro!$A$5:$K$272,4,FALSE),0)","v":2},{"$f":"IFERROR(VLOOKUP($A146,Filtro!$A$5:$K$272,5,FALSE),0)","v":286}]
["80302046","0302046","Gases y equilibrio ácido base en sangre (incluye: pH, O2, CO2, exceso de base y bicarbonato), todos o cada uno de los parámetros",0,{"$f":"IFERROR(VLOOKUP($A147,Filtro!$A$5:$K$272,3,FALSE),0)","v":0},{"$f":"IFERROR(VLOOKUP($A147,Filtro!$A$5:$K$272,4,FALSE),0)","v":0},{"$f":"IFERROR(VLOOKUP($A147,Filtro!$A$5:$K$272,5,FALSE),0)","v":0}]
["80302047","0302047","Glucosa en sangre",{"v":11416,"d":"11,416"},{"$f":"IFERROR(VLOOKUP($A148,Filtro!$A$5:$K$272,3,FALSE),0)","v":447},{"$f":"IFERROR(VLOOKUP($A148,Filtro!$A$5:$K$272,4,FALSE),0)","v":{"v":10969,"d":"10,969"}},{"$f":"IFERROR(VLOOKUP($A148,Filtro!$A$5:$K$272,5,FALSE),0)","v":{"v":22408,"d":"22,408"}}]
["80302048","0302048","Glucosa, Prueba de Tolerancia a la Glucosa Oral (PTGO), (dos determinaciones) (no incluye la glucosa que se administra) (incluye el valor de las dos tomas de muestras)",832,{"$f":"IFERROR(VLOOKUP($A149,Filtro!$A$5:$K$272,3,FALSE),0)","v":0},{"$f":"IFERROR(VLOOKUP($A149,Filtro!$A$5:$K$272,4,FALSE),0)","v":832},{"$f":"IFERROR(VLOOKUP($A149,Filtro!$A$5:$K$272,5,FALSE),0)","v":{"v":1953,"d":"1,953"}}]
["80302050","0302050","Adenosindeaminasa en sangre u otro fluído biológico.",0,{"$f":"IFERROR(VLOOKUP($A150,Filtro!$A$5:$K$272,3,FALSE),0)","v":0},{"$f":"IFERROR(VLOOKUP($A150,Filtro!$A$5:$K$272,4,FALSE),0)","v":0},{"$f":"IFERROR(VLOOKUP($A150,Filtro!$A$5:$K$272,5,FALSE),0)","v":3}]
["80302051","0302051","Lactosa, curva de tolerancia, (mínimo cuatro determinaciones) (no incluye la lactosa que se administra) (incluye los valores de todas las tomas de muestras necesarias)",0,{"$f":"IFERROR(VLOOKUP($A151,Filtro!$A$5:$K$272,3,FALSE),0)","v":0},{"$f":"IFERROR(VLOOKUP($A151,Filtro!$A$5:$K$272,4,FALSE),0)","v":0},{"$f":"IFERROR(VLOOKUP($A151,Filtro!$A$5:$K$272,5,FALSE),0)","v":7}]
["80302052","0302052","Leucinaminopeptidasa (LAP)",0,{"$f":"IFERROR(VLOOKUP($A152,Filtro!$A$5:$K$272,3,FALSE),0)","v":0},{"$f":"IFERROR(VLOOKUP($A152,Filtro!$A$5:$K$272,4,FALSE),0)","v":0},{"$f":"IFERROR(VLOOKUP($A152,Filtro!$A$5:$K$272,5,FALSE),0)","v":0}]
["80302053","0302053","Lipasa",0,{"$f":"IFERROR(VLOOKUP($A153,Filtro!$A$5:$K$272,3,FALSE),0)","v":0},{"$f":"IFERROR(VLOOKUP($A153,Filtro!$A$5:$K$272,4,FALSE),0)","v":0},{"$f":"IFERROR(VLOOKUP($A153,Filtro!$A$5:$K$272,5,FALSE),0)","v":2}]
["80302069","0302069","Lípidos totales (proc. aut.)",0,{"$f":"IFERROR(VLOOKUP($A154,Filtro!$A$5:$K$272,3,FALSE),0)","v":0},{"$f":"IFERROR(VLOOKUP($A154,Filtro!$A$5:$K$272,4,FALSE),0)","v":0},{"$f":"IFERROR(VLOOKUP($A154,Filtro!$A$5:$K$272,5,FALSE),0)","v":828}]
["80302054","0302054","Lipoproteínas, electroforesis de (incluye lípidos totales)",0,{"$f":"IFERROR(VLOOKUP($A155,Filtro!$A$5:$K$272,3,FALSE),0)","v":0},{"$f":"IFERROR(VLOOKUP($A155,Filtro!$A$5:$K$272,4,FALSE),0)","v":0},{"$f":"IFERROR(VLOOKUP($A155,Filtro!$A$5:$K$272,5,FALSE),0)","v":7}]
["80302055","0302055","Litio",0,{"$f":"IFERROR(VLOOKUP($A156,Filtro!$A$5:$K$272,3,FALSE),0)","v":0},{"$f":"IFERROR(VLOOKUP($A156,Filtro!$A$5:$K$272,4,FALSE),0)","v":0},{"$f":"IFERROR(VLOOKUP($A156,Filtro!$A$5:$K$272,5,FALSE),0)","v":0}]
["80302056","0302056","Magnesio",0,{"$f":"IFERROR(VLOOKUP($A157,Filtro!$A$5:$K$272,3,FALSE),0)","v":0},{"$f":"IFERROR(VLOOKUP($A157,Filtro!$A$5:$K$272,4,FALSE),0)","v":0},{"$f":"IFERROR(VLOOKUP($A157,Filtro!$A$5:$K$272,5,FALSE),0)","v":0}]
["80302057","0302057","Nitrógeno ureico y/o úrea en sangre",{"v":5009,"d":"5,009"},{"$f":"IFERROR(VLOOKUP($A158,Filtro!$A$5:$K$272,3,FALSE),0)","v":0},{"$f":"IFERROR(VLOOKUP($A158,Filtro!$A$5:$K$272,4,FALSE),0)","v":{"v":5009,"d":"5,009"}},{"$f":"IFERROR(VLOOKUP($A158,Filtro!$A$5:$K$272,5,FALSE),0)","v":{"v":7271,"d":"7,271"}}]
["80302058","0302058","Osmolalidad en sangre",0,{"$f":"IFERROR(VLOOKUP($A159,Filtro!$A$5:$K$272,3,FALSE),0)","v":0},{"$f":"IFERROR(VLOOKUP($A159,Filtro!$A$5:$K$272,4,FALSE),0)","v":0},{"$f":"IFERROR(VLOOKUP($A159,Filtro!$A$5:$K$272,5,FALSE),0)","v":0}]
["80302075","0302075","Perfil bioquímico (determinación automatizada de 12 parámetros)",2,{"$f":"IFERROR(VLOOKUP($A160,Filtro!$A$5:$K$272,3,FALSE),0)","v":0},{"$f":"IFERROR(VLOOKUP($A160,Filtro!$A$5:$K$272,4,FALSE),0)","v":2},{"$f":"IFERROR(VLOOKUP($A160,Filtro!$A$5:$K$272,5,FALSE),0)","v":303}]
["80302059","0302059","Proteínas fraccionadas albúmina/globulina (incluye código 03-02-060)",189,{"$f":"IFERROR(VLOOKUP($A161,Filtro!$A$5:$K$272,3,FALSE),0)","v":0},{"$f":"IFERROR(VLOOKUP($A161,Filtro!$A$5:$K$272,4,FALSE),0)","v":189},{"$f":"IFERROR(VLOOKUP($A161,Filtro!$A$5:$K$272,5,FALSE),0)","v":0}]
["80302060","0302060","Proteínas totales o albúminas, c/u en sangre",171,{"$f":"IFERROR(VLOOKUP($A162,Filtro!$A$5:$K$272,3,FALSE),0)","v":0},{"$f":"IFERROR(VLOOKUP($A162,Filtro!$A$5:$K$272,4,FALSE),0)","v":171},{"$f":"IFERROR(VLOOKUP($A162,Filtro!$A$5:$K$272,5,FALSE),0)","v":618}]
["80302061","0302061","Proteínas, electroforesis (incluye cód. 03-02-060)",0,{"$f":"IFERROR(VLOOKUP($A163,Filtro!$A$5:$K$272,3,FALSE),0)","v":0},{"$f":"IFERROR(VLOOKUP($A163,Filtro!$A$5:$K$272,4,FALSE),0)","v":0},{"$f":"IFERROR(VLOOKUP($A163,Filtro!$A$5:$K$272,5,FALSE),0)","v":0}]
["80302062","0302062","Salicilemia cuantitativa        ",0,{"$f":"IFERROR(VLOOKUP($A164,Filtro!$A$5:$K$272,3,FALSE),0)","v":0},{"$f":"IFERROR(VLOOKUP($A164,Filtro!$A$5:$K$272,4,FALSE),0)","v":0},{"$f":"IFERROR(VLOOKUP($A164,Filtro!$A$5:$K$272,5,FALSE),0)","v":0}]
["80302076","0302076","Perfil Hepático (incluye tiempo de protrombina, bilirrubina total y conjugada, fosfatasas alcalinas totales, GGT, transaminasas GOT/AST y GPT/ALT)",{"v":4753,"d":"4,753"},{"$f":"IFERROR(VLOOKUP($A165,Filtro!$A$5:$K$272,3,FALSE),0)","v":0},{"$f":"IFERROR(VLOOKUP($A165,Filtro!$A$5:$K$272,4,FALSE),0)","v":{"v":4753,"d":"4,753"}},{"$f":"IFERROR(VLOOKUP($A165,Filtro!$A$5:$K$272,5,FALSE),0)","v":{"v":4541,"d":"4,541"}}]
["80302063","0302063","Transaminasas, oxalacética (GOT/AST), Pirúvica (GPT/ALT), c/u",{"$f":"SUM(E166:F166)","v":43},{"$f":"IFERROR(VLOOKUP($A166,Filtro!$A$5:$K$272,3,FALSE),0)","v":0},{"$f":"IFERROR(VLOOKUP($A166,Filtro!$A$5:$K$272,4,FALSE),0)","v":43},{"$f":"IFERROR(VLOOKUP($A166,Filtro!$A$5:$K$272,5,FALSE),0)","v":{"v":2931,"d":"2,931"}}]
["80302064","0302064","Triglicéridos (proc. aut.)",257,{"$f":"IFERROR(VLOOKUP($A167,Filtro!$A$5:$K$272,3,FALSE),0)","v":0},{"$f":"IFERROR(VLOOKUP($A167,Filtro!$A$5:$K$272,4,FALSE),0)","v":257},{"$f":"IFERROR(VLOOKUP($A167,Filtro!$A$5:$K$272,5,FALSE),0)","v":{"v":10873,"d":"10,873"}}]
["80302065","0302065","Vitaminas A, B, C, D, E, etc., c/u",0,{"$f":"IFERROR(VLOOKUP($A168,Filtro!$A$5:$K$272,3,FALSE),0)","v":0},{"$f":"IFERROR(VLOOKUP($A168,Filtro!$A$5:$K$272,4,FALSE),0)","v":0},{"$f":"IFERROR(VLOOKUP($A168,Filtro!$A$5:$K$272,5,FALSE),0)","v":28}]
["80302066","0302066","Xilosa, prueba de absorción (no incluye la xilosa que se administra)",0,{"$f":"IFERROR(VLOOKUP($A169,Filtro!$A$5:$K$272,3,FALSE),0)","v":0},{"$f":"IFERROR(VLOOKUP($A169,Filtro!$A$5:$K$272,4,FALSE),0)","v":0},{"$f":"IFERROR(VLOOKUP($A169,Filtro!$A$5:$K$272,5,FALSE),0)","v":0}]
[null,"TOTAL",null,{"$f":"SUM(D101:D169)","v":{"v":61089,"d":"61,089"}},{"$f":"SUM(E101:E169)","v":447},{"$f":"SUM(F101:F169)","v":{"v":60642,"d":"60,642"}},{"$f":"SUM(G101:G169)","v":{"v":128571,"d":"128,571"}}]
[]
[null," EXÁMENES HORMONALES"]
["80303015","0303015","Hormona folículo estimulante (FSH)",{"$f":"SUM(E173:F173)","v":0},{"$f":"IFERROR(VLOOKUP($A173,Filtro!$A$5:$K$272,3,FALSE),0)","v":0},{"$f":"IFERROR(VLOOKUP($A173,Filtro!$A$5:$K$272,4,FALSE),0)","v":0},{"$f":"IFERROR(VLOOKUP($A173,Filtro!$A$5:$K$272,5,FALSE),0)","v":{"v":1093,"d":"1,093"}}]
["80303024","0303024","Tiroestimulante (TSH), hormona (adulto, niño o R.N.)                            ",{"$f":"SUM(E174:F174)","v":{"v":6856,"d":"6,856"}},{"$f":"IFERROR(VLOOKUP($A174,Filtro!$A$5:$K$272,3,FALSE),0)","v":0},{"$f":"IFERROR(VLOOKUP($A174,Filtro!$A$5:$K$272,4,FALSE),0)","v":{"v":6856,"d":"6,856"}},{"$f":"IFERROR(VLOOKUP($A174,Filtro!$A$5:$K$272,5,FALSE),0)","v":{"v":13188,"d":"13,188"}}]
["80303025","0303025","Tiroglobulina                                                                                   ",0,{"$f":"IFERROR(VLOOKUP($A175,Filtro!$A$5:$K$272,3,FALSE),0)","v":0},{"$f":"IFERROR(VLOOKUP($A175,Filtro!$A$5:$K$272,4,FALSE),0)","v":0},{"$f":"IFERROR(VLOOKUP($A175,Filtro!$A$5:$K$272,5,FALSE),0)","v":11}]
["80303026","0303026","Tiroxina libre (T4L)                                                                       ",{"v":5117,"d":"5,117"},{"$f":"IFERROR(VLOOKUP($A176,Filtro!$A$5:$K$272,3,FALSE),0)","v":0},{"$f":"IFERROR(VLOOKUP($A176,Filtro!$A$5:$K$272,4,FALSE),0)","v":{"v":5117,"d":"5,117"}},{"$f":"IFERROR(VLOOKUP($A176,Filtro!$A$5:$K$272,5,FALSE),0)","v":{"v":5082,"d":"5,082"}}]
["80303027","0303027","Tiroxina o tetrayodotironina (T4)                                               ",120,{"$f":"IFERROR(VLOOKUP($A177,Filtro!$A$5:$K$272,3,FALSE),0)","v":0},{"$f":"IFERROR(VLOOKUP($A177,Filtro!$A$5:$K$272,4,FALSE),0)","v":120},{"$f":"IFERROR(VLOOKUP($A177,Filtro!$A$5:$K$272,5,FALSE),0)","v":2}]
["80303028","0303028","Triyodotironina (T3)                                                               ",74,{"$f":"IFERROR(VLOOKUP($A178,Filtro!$A$5:$K$272,3,FALSE),0)","v":0},{"$f":"IFERROR(VLOOKUP($A178,Filtro!$A$5:$K$272,4,FALSE),0)","v":74},{"$f":"IFERROR(VLOOKUP($A178,Filtro!$A$5:$K$272,5,FALSE),0)","v":3}]
[null,"TOTAL",null,{"$f":"SUM(D173:D178)","v":{"v":12167,"d":"12,167"}},{"$f":"SUM(E173:E178)","v":0},{"$f":"SUM(F173:F178)","v":{"v":12167,"d":"12,167"}},{"$f":"SUM(G173:G178)","v":{"v":19379,"d":"19,379"}}]
[]
[null,"INMUNOLÓGICOS"]
["80305001","0305001","Alfa -1- antitripsina cuantitativa",{"$f":"SUM(E182:F182)","v":0},{"$f":"IFERROR(VLOOKUP($A182,Filtro!$A$5:$K$272,3,FALSE),0)","v":0},{"$f":"IFERROR(VLOOKUP($A182,Filtro!$A$5:$K$272,4,FALSE),0)","v":0},{"$f":"IFERROR(VLOOKUP($A182,Filtro!$A$5:$K$272,5,FALSE),0)","v":0}]
["80305002","0305002","Alfa -2- macroglobulina",{"$f":"SUM(E183:F183)","v":0},{"$f":"IFERROR(VLOOKUP($A183,Filtro!$A$5:$K$272,3,FALSE),0)","v":0},{"$f":"IFERROR(VLOOKUP($A183,Filtro!$A$5:$K$272,4,FALSE),0)","v":0},{"$f":"IFERROR(VLOOKUP($A183,Filtro!$A$5:$K$272,5,FALSE),0)","v":0}]
["80305003","0305003","Alfa fetoproteínas",0,{"$f":"IFERROR(VLOOKUP($A184,Filtro!$A$5:$K$272,3,FALSE),0)","v":0},{"$f":"IFERROR(VLOOKUP($A184,Filtro!$A$5:$K$272,4,FALSE),0)","v":0},{"$f":"IFERROR(VLOOKUP($A184,Filtro!$A$5:$K$272,5,FALSE),0)","v":0}]
["80305004","0305004","Tamizaje de Anticuerpos anti antígenos nucleares extractables (a- ENA: Sm, RNP, Ro, La, Scl- 70 y Jo- 1)",0,{"$f":"IFERROR(VLOOKUP($A185,Filtro!$A$5:$K$272,3,FALSE),0)","v":0},{"$f":"IFERROR(VLOOKUP($A185,Filtro!$A$5:$K$272,4,FALSE),0)","v":0},{"$f":"IFERROR(VLOOKUP($A185,Filtro!$A$5:$K$272,5,FALSE),0)","v":1}]
["80305005","0305005","Anticuerpos antinucleares (ANA), antimitocondriales, anti DNA (ADNA), anti músculo liso, anticentrómero, u otros, c/u.",0,{"$f":"IFERROR(VLOOKUP($A186,Filtro!$A$5:$K$272,3,FALSE),0)","v":0},{"$f":"IFERROR(VLOOKUP($A186,Filtro!$A$5:$K$272,4,FALSE),0)","v":0},{"$f":"IFERROR(VLOOKUP($A186,Filtro!$A$5:$K$272,5,FALSE),0)","v":304}]
["80305006","0305006","Anticuerpos atípicos, pannel de identificación",0,{"$f":"IFERROR(VLOOKUP($A187,Filtro!$A$5:$K$272,3,FALSE),0)","v":0},{"$f":"IFERROR(VLOOKUP($A187,Filtro!$A$5:$K$272,4,FALSE),0)","v":0},{"$f":"IFERROR(VLOOKUP($A187,Filtro!$A$5:$K$272,5,FALSE),0)","v":0}]
["80305007","0305007","Anticuerpos específicos y otros autoanticuerpos (anticuerpos antitiroídeos: anticuerpos antimicrosomales y antitiroglobulinas y otros anticuerpos: prostático, espermios, etc.) c/u",0,{"$f":"IFERROR(VLOOKUP($A188,Filtro!$A$5:$K$272,3,FALSE),0)","v":0},{"$f":"IFERROR(VLOOKUP($A188,Filtro!$A$5:$K$272,4,FALSE),0)","v":0},{"$f":"IFERROR(VLOOKUP($A188,Filtro!$A$5:$K$272,5,FALSE),0)","v":0}]
["80305008","0305008","Antiestreptolisina O, por técnica de látex ",0,{"$f":"IFERROR(VLOOKUP($A189,Filtro!$A$5:$K$272,3,FALSE),0)","v":0},{"$f":"IFERROR(VLOOKUP($A189,Filtro!$A$5:$K$272,4,FALSE),0)","v":0},{"$f":"IFERROR(VLOOKUP($A189,Filtro!$A$5:$K$272,5,FALSE),0)","v":0}]
["80305009","0305009","Antígeno carcinoembrionario (CEA)",0,{"$f":"IFERROR(VLOOKUP($A190,Filtro!$A$5:$K$272,3,FALSE),0)","v":0},{"$f":"IFERROR(VLOOKUP($A190,Filtro!$A$5:$K$272,4,FALSE),0)","v":0},{"$f":"IFERROR(VLOOKUP($A190,Filtro!$A$5:$K$272,5,FALSE),0)","v":1}]
["80305070","0305070","Antígeno prostático específico",305,{"$f":"IFERROR(VLOOKUP($A191,Filtro!$A$5:$K$272,3,FALSE),0)","v":0},{"$f":"IFERROR(VLOOKUP($A191,Filtro!$A$5:$K$272,4,FALSE),0)","v":305},{"$f":"IFERROR(VLOOKUP($A191,Filtro!$A$5:$K$272,5,FALSE),0)","v":{"v":1268,"d":"1,268"}}]
["80305170","0305170","Antígeno Ca 125, Ca 15-3 y Ca 19-9, c/u",0,{"$f":"IFERROR(VLOOKUP($A192,Filtro!$A$5:$K$272,3,FALSE),0)","v":0},{"$f":"IFERROR(VLOOKUP($A192,Filtro!$A$5:$K$272,4,FALSE),0)","v":0},{"$f":"IFERROR(VLOOKUP($A192,Filtro!$A$5:$K$272,5,FALSE),0)","v":1}]
["80305010","0305010","Beta-2-microglobulina",0,{"$f":"IFERROR(VLOOKUP($A193,Filtro!$A$5:$K$272,3,FALSE),0)","v":0},{"$f":"IFERROR(VLOOKUP($A193,Filtro!$A$5:$K$272,4,FALSE),0)","v":0},{"$f":"IFERROR(VLOOKUP($A193,Filtro!$A$5:$K$272,5,FALSE),0)","v":0}]
["80305011","0305011","Complejos inmunes circulantes",0,{"$f":"IFERROR(VLOOKUP($A194,Filtro!$A$5:$K$272,3,FALSE),0)","v":0},{"$f":"IFERROR(VLOOKUP($A194,Filtro!$A$5:$K$272,4,FALSE),0)","v":0},{"$f":"IFERROR(VLOOKUP($A194,Filtro!$A$5:$K$272,5,FALSE),0)","v":0}]
["80305012","0305012","Complemento C1Q, C2, C3, C4, etc., c/u",0,{"$f":"IFERROR(VLOOKUP($A195,Filtro!$A$5:$K$272,3,FALSE),0)","v":0},{"$f":"IFERROR(VLOOKUP($A195,Filtro!$A$5:$K$272,4,FALSE),0)","v":0},{"$f":"IFERROR(VLOOKUP($A195,Filtro!$A$5:$K$272,5,FALSE),0)","v":2}]
["80305013","0305013","Complemento hemolítico (CH 50)",0,{"$f":"IFERROR(VLOOKUP($A196,Filtro!$A$5:$K$272,3,FALSE),0)","v":0},{"$f":"IFERROR(VLOOKUP($A196,Filtro!$A$5:$K$272,4,FALSE),0)","v":0},{"$f":"IFERROR(VLOOKUP($A196,Filtro!$A$5:$K$272,5,FALSE),0)","v":0}]
["80305014","0305014","Crioglobulinas, precipitación en frío (cualitativa) o cuantitativa c/u",0,{"$f":"IFERROR(VLOOKUP($A197,Filtro!$A$5:$K$272,3,FALSE),0)","v":0},{"$f":"IFERROR(VLOOKUP($A197,Filtro!$A$5:$K$272,4,FALSE),0)","v":0},{"$f":"IFERROR(VLOOKUP($A197,Filtro!$A$5:$K$272,5,FALSE),0)","v":0}]
["80305015","0305015","Depósito de complejos inmunes por inmunofluorescencia",0,{"$f":"IFERROR(VLOOKUP($A198,Filtro!$A$5:$K$272,3,FALSE),0)","v":0},{"$f":"IFERROR(VLOOKUP($A198,Filtro!$A$5:$K$272,4,FALSE),0)","v":0},{"$f":"IFERROR(VLOOKUP($A198,Filtro!$A$5:$K$272,5,FALSE),0)","v":0}]
["80305016","0305016","Depósito de complemento por inmunofluorescencia (C3, C4), c/u",0,{"$f":"IFERROR(VLOOKUP($A199,Filtro!$A$5:$K$272,3,FALSE),0)","v":0},{"$f":"IFERROR(VLOOKUP($A199,Filtro!$A$5:$K$272,4,FALSE),0)","v":0},{"$f":"IFERROR(VLOOKUP($A199,Filtro!$A$5:$K$272,5,FALSE),0)","v":0}]
["80305017","0305017","Depósito de fibrinógeno por inmunofluorescencia",0,{"$f":"IFERROR(VLOOKUP($A200,Filtro!$A$5:$K$272,3,FALSE),0)","v":0},{"$f":"IFERROR(VLOOKUP($A200,Filtro!$A$5:$K$272,4,FALSE),0)","v":0},{"$f":"IFERROR(VLOOKUP($A200,Filtro!$A$5:$K$272,5,FALSE),0)","v":0}]
["80305018","0305018","Depósito de inmunoglobulina por inmunofluorescencia (IgG, IgA, IgM) c/u",0,{"$f":"IFERROR(VLOOKUP($A201,Filtro!$A$5:$K$272,3,FALSE),0)","v":0},{"$f":"IFERROR(VLOOKUP($A201,Filtro!$A$5:$K$272,4,FALSE),0)","v":0},{"$f":"IFERROR(VLOOKUP($A201,Filtro!$A$5:$K$272,5,FALSE),0)","v":0}]
["80305019","0305019","Factor reumatoídeo por técnica de látex u otras similares",271,{"$f":"IFERROR(VLOOKUP($A202,Filtro!$A$5:$K$272,3,FALSE),0)","v":0},{"$f":"IFERROR(VLOOKUP($A202,Filtro!$A$5:$K$272,4,FALSE),0)","v":271},{"$f":"IFERROR(VLOOKUP($A202,Filtro!$A$5:$K$272,5,FALSE),0)","v":596}]
["80305020","0305020","Factor reumatoídeo por técnica Scat, Waaler Rose, nefelométricas y/o turbidimétricas",2,{"$f":"IFERROR(VLOOKUP($A203,Filtro!$A$5:$K$272,3,FALSE),0)","v":0},{"$f":"IFERROR(VLOOKUP($A203,Filtro!$A$5:$K$272,4,FALSE),0)","v":2},{"$f":"IFERROR(VLOOKUP($A203,Filtro!$A$5:$K$272,5,FALSE),0)","v":85}]
["80305021","0305021","Inhibidor de C1Q, C2 y C3, c/u",0,{"$f":"IFERROR(VLOOKUP($A204,Filtro!$A$5:$K$272,3,FALSE),0)","v":0},{"$f":"IFERROR(VLOOKUP($A204,Filtro!$A$5:$K$272,4,FALSE),0)","v":0},{"$f":"IFERROR(VLOOKUP($A204,Filtro!$A$5:$K$272,5,FALSE),0)","v":0}]
["80305025","0305025","Inmunofijación de inmunoglobulina, c/u",0,{"$f":"IFERROR(VLOOKUP($A205,Filtro!$A$5:$K$272,3,FALSE),0)","v":0},{"$f":"IFERROR(VLOOKUP($A205,Filtro!$A$5:$K$272,4,FALSE),0)","v":0},{"$f":"IFERROR(VLOOKUP($A205,Filtro!$A$5:$K$272,5,FALSE),0)","v":0}]
["80305026","0305026","Inmunoglobulina IgA secretora",0,{"$f":"IFERROR(VLOOKUP($A206,Filtro!$A$5:$K$272,3,FALSE),0)","v":0},{"$f":"IFERROR(VLOOKUP($A206,Filtro!$A$5:$K$272,4,FALSE),0)","v":0},{"$f":"IFERROR(VLOOKUP($A206,Filtro!$A$5:$K$272,5,FALSE),0)","v":0}]
["80305027","0305027","Inmunoglobulinas IgA, IgG, IgM, c/u",0,{"$f":"IFERROR(VLOOKUP($A207,Filtro!$A$5:$K$272,3,FALSE),0)","v":0},{"$f":"IFERROR(VLOOKUP($A207,Filtro!$A$5:$K$272,4,FALSE),0)","v":0},{"$f":"IFERROR(VLOOKUP($A207,Filtro!$A$5:$K$272,5,FALSE),0)","v":0}]
["80305028","0305028","Inmunoglobulinas IgE, IgD total, c/u",0,{"$f":"IFERROR(VLOOKUP($A208,Filtro!$A$5:$K$272,3,FALSE),0)","v":0},{"$f":"IFERROR(VLOOKUP($A208,Filtro!$A$5:$K$272,4,FALSE),0)","v":0},{"$f":"IFERROR(VLOOKUP($A208,Filtro!$A$5:$K$272,5,FALSE),0)","v":0}]
["80305029","0305029","Inmunoglobulinas IgE, IgG específicas, c/u",0,{"$f":"IFERROR(VLOOKUP($A209,Filtro!$A$5:$K$272,3,FALSE),0)","v":0},{"$f":"IFERROR(VLOOKUP($A209,Filtro!$A$5:$K$272,4,FALSE),0)","v":0},{"$f":"IFERROR(VLOOKUP($A209,Filtro!$A$5:$K$272,5,FALSE),0)","v":0}]
["80305030","0305030","Proteína C reactiva por técnica de látex u otras similares",1,{"$f":"IFERROR(VLOOKUP($A210,Filtro!$A$5:$K$272,3,FALSE),0)","v":0},{"$f":"IFERROR(VLOOKUP($A210,Filtro!$A$5:$K$272,4,FALSE),0)","v":1},{"$f":"IFERROR(VLOOKUP($A210,Filtro!$A$5:$K$272,5,FALSE),0)","v":23}]
["80305031","0305031","Proteína C reactiva por técnicas nefelométricas y/o turbidimétricas",0,{"$f":"IFERROR(VLOOKUP($A211,Filtro!$A$5:$K$272,3,FALSE),0)","v":0},{"$f":"IFERROR(VLOOKUP($A211,Filtro!$A$5:$K$272,4,FALSE),0)","v":0},{"$f":"IFERROR(VLOOKUP($A211,Filtro!$A$5:$K$272,5,FALSE),0)","v":0}]
["80305034","0305034","Quimiotaxis-leucotaxis",0,{"$f":"IFERROR(VLOOKUP($A212,Filtro!$A$5:$K$272,3,FALSE),0)","v":0},{"$f":"IFERROR(VLOOKUP($A212,Filtro!$A$5:$K$272,4,FALSE),0)","v":0},{"$f":"IFERROR(VLOOKUP($A212,Filtro!$A$5:$K$272,5,FALSE),0)","v":0}]
["80305035","0305035","Crioaglutininas",0,{"$f":"IFERROR(VLOOKUP($A213,Filtro!$A$5:$K$272,3,FALSE),0)","v":0},{"$f":"IFERROR(VLOOKUP($A213,Filtro!$A$5:$K$272,4,FALSE),0)","v":0},{"$f":"IFERROR(VLOOKUP($A213,Filtro!$A$5:$K$272,5,FALSE),0)","v":0}]
["80305036","0305036","Criohemolisinas",0,{"$f":"IFERROR(VLOOKUP($A214,Filtro!$A$5:$K$272,3,FALSE),0)","v":0},{"$f":"IFERROR(VLOOKUP($A214,Filtro!$A$5:$K$272,4,FALSE),0)","v":0},{"$f":"IFERROR(VLOOKUP($A214,Filtro!$A$5:$K$272,5,FALSE),0)","v":0}]
["80305037","0305037","Digestión fagocítica nitroblue-tetrazolium cualitativo y cuantitativo",0,{"$f":"IFERROR(VLOOKUP($A215,Filtro!$A$5:$K$272,3,FALSE),0)","v":0},{"$f":"IFERROR(VLOOKUP($A215,Filtro!$A$5:$K$272,4,FALSE),0)","v":0},{"$f":"IFERROR(VLOOKUP($A215,Filtro!$A$5:$K$272,5,FALSE),0)","v":0}]
["80305038","0305038","Fagocitosis: ingestión y digestión (killing) de levaduras por polimorfonucleares",0,{"$f":"IFERROR(VLOOKUP($A216,Filtro!$A$5:$K$272,3,FALSE),0)","v":0},{"$f":"IFERROR(VLOOKUP($A216,Filtro!$A$5:$K$272,4,FALSE),0)","v":0},{"$f":"IFERROR(VLOOKUP($A216,Filtro!$A$5:$K$272,5,FALSE),0)","v":0}]
["80305039","0305039","Fagocitosis: ingestión y digestión (killing) de bacterias por polimorfonucleares",0,{"$f":"IFERROR(VLOOKUP($A217,Filtro!$A$5:$K$272,3,FALSE),0)","v":0},{"$f":"IFERROR(VLOOKUP($A217,Filtro!$A$5:$K$272,4,FALSE),0)","v":0},{"$f":"IFERROR(VLOOKUP($A217,Filtro!$A$5:$K$272,5,FALSE),0)","v":0}]
["80305040","0305040","Inmunoadherencia de leucocitos macrófagos",0,{"$f":"IFERROR(VLOOKUP($A218,Filtro!$A$5:$K$272,3,FALSE),0)","v":0},{"$f":"IFERROR(VLOOKUP($A218,Filtro!$A$5:$K$272,4,FALSE),0)","v":0},{"$f":"IFERROR(VLOOKUP($A218,Filtro!$A$5:$K$272,5,FALSE),0)","v":0}]
["80305041","0305041","Intradermoreacción (PPD, histoplasmina, aspergilina, u otros, incluye el valor del antígeno y reacción de control), c/u. ",0,{"$f":"IFERROR(VLOOKUP($A219,Filtro!$A$5:$K$272,3,FALSE),0)","v":0},{"$f":"IFERROR(VLOOKUP($A219,Filtro!$A$5:$K$272,4,FALSE),0)","v":0},{"$f":"IFERROR(VLOOKUP($A219,Filtro!$A$5:$K$272,5,FALSE),0)","v":0}]
["80305042","0305042","LIF o MIF",0,{"$f":"IFERROR(VLOOKUP($A220,Filtro!$A$5:$K$272,3,FALSE),0)","v":0},{"$f":"IFERROR(VLOOKUP($A220,Filtro!$A$5:$K$272,4,FALSE),0)","v":0},{"$f":"IFERROR(VLOOKUP($A220,Filtro!$A$5:$K$272,5,FALSE),0)","v":0}]
["80305043","0305043","Linfocitos B (inmunofluorescencia)",0,{"$f":"IFERROR(VLOOKUP($A221,Filtro!$A$5:$K$272,3,FALSE),0)","v":0},{"$f":"IFERROR(VLOOKUP($A221,Filtro!$A$5:$K$272,4,FALSE),0)","v":0},{"$f":"IFERROR(VLOOKUP($A221,Filtro!$A$5:$K$272,5,FALSE),0)","v":0}]
["80305044","0305044","Linfocitos B (rosetas EAC) y linfocitos T (rosetas E) c/u",0,{"$f":"IFERROR(VLOOKUP($A222,Filtro!$A$5:$K$272,3,FALSE),0)","v":0},{"$f":"IFERROR(VLOOKUP($A222,Filtro!$A$5:$K$272,4,FALSE),0)","v":0},{"$f":"IFERROR(VLOOKUP($A222,Filtro!$A$5:$K$272,5,FALSE),0)","v":0}]
["80305045","0305045","Linfocitos T \"helper\" (OKT4) o supresores (OKT8) con antisuero monoclonal, c/u",0,{"$f":"IFERROR(VLOOKUP($A223,Filtro!$A$5:$K$272,3,FALSE),0)","v":0},{"$f":"IFERROR(VLOOKUP($A223,Filtro!$A$5:$K$272,4,FALSE),0)","v":0},{"$f":"IFERROR(VLOOKUP($A223,Filtro!$A$5:$K$272,5,FALSE),0)","v":0}]
["80305047","0305047","Linfotoxinas humanas, detección de",0,{"$f":"IFERROR(VLOOKUP($A224,Filtro!$A$5:$K$272,3,FALSE),0)","v":0},{"$f":"IFERROR(VLOOKUP($A224,Filtro!$A$5:$K$272,4,FALSE),0)","v":0},{"$f":"IFERROR(VLOOKUP($A224,Filtro!$A$5:$K$272,5,FALSE),0)","v":0}]
["80305048","0305048","Reacción cutánea 16 alergenos por escarificación (incluye el valor de los antígenos)",0,{"$f":"IFERROR(VLOOKUP($A225,Filtro!$A$5:$K$272,3,FALSE),0)","v":0},{"$f":"IFERROR(VLOOKUP($A225,Filtro!$A$5:$K$272,4,FALSE),0)","v":0},{"$f":"IFERROR(VLOOKUP($A225,Filtro!$A$5:$K$272,5,FALSE),0)","v":0}]
["80305049","0305049","Transformación linfoblástica a drogas, análisis de transformación espontanea con estimulo inespecífico y con diferentes concentraciones de la droga en 1000 células",0,{"$f":"IFERROR(VLOOKUP($A226,Filtro!$A$5:$K$272,3,FALSE),0)","v":0},{"$f":"IFERROR(VLOOKUP($A226,Filtro!$A$5:$K$272,4,FALSE),0)","v":0},{"$f":"IFERROR(VLOOKUP($A226,Filtro!$A$5:$K$272,5,FALSE),0)","v":0}]
["80305051","0305051","Absorción de autoanticuerpos del receptor",0,{"$f":"IFERROR(VLOOKUP($A227,Filtro!$A$5:$K$272,3,FALSE),0)","v":0},{"$f":"IFERROR(VLOOKUP($A227,Filtro!$A$5:$K$272,4,FALSE),0)","v":0},{"$f":"IFERROR(VLOOKUP($A227,Filtro!$A$5:$K$272,5,FALSE),0)","v":0}]
["80305052","0305052","Anticuerpos linfocitotóxicos (PRA) por microlinfocitotoxicidad",0,{"$f":"IFERROR(VLOOKUP($A228,Filtro!$A$5:$K$272,3,FALSE),0)","v":0},{"$f":"IFERROR(VLOOKUP($A228,Filtro!$A$5:$K$272,4,FALSE),0)","v":0},{"$f":"IFERROR(VLOOKUP($A228,Filtro!$A$5:$K$272,5,FALSE),0)","v":0}]
["80305053","0305053","Autocrossmatch con linfocitos T y B",0,{"$f":"IFERROR(VLOOKUP($A229,Filtro!$A$5:$K$272,3,FALSE),0)","v":0},{"$f":"IFERROR(VLOOKUP($A229,Filtro!$A$5:$K$272,4,FALSE),0)","v":0},{"$f":"IFERROR(VLOOKUP($A229,Filtro!$A$5:$K$272,5,FALSE),0)","v":0}]
["80305054","0305054","Autocross match con linfocitos totales",0,{"$f":"IFERROR(VLOOKUP($A230,Filtro!$A$5:$K$272,3,FALSE),0)","v":0},{"$f":"IFERROR(VLOOKUP($A230,Filtro!$A$5:$K$272,4,FALSE),0)","v":0},{"$f":"IFERROR(VLOOKUP($A230,Filtro!$A$5:$K$272,5,FALSE),0)","v":0}]
["80305056","0305056","Alocrossmatch con linfocitos totales",0,{"$f":"IFERROR(VLOOKUP($A231,Filtro!$A$5:$K$272,3,FALSE),0)","v":0},{"$f":"IFERROR(VLOOKUP($A231,Filtro!$A$5:$K$272,4,FALSE),0)","v":0},{"$f":"IFERROR(VLOOKUP($A231,Filtro!$A$5:$K$272,5,FALSE),0)","v":0}]
["80305057","0305057","Alocrossmatch con linfocitos T y B",0,{"$f":"IFERROR(VLOOKUP($A232,Filtro!$A$5:$K$272,3,FALSE),0)","v":0},{"$f":"IFERROR(VLOOKUP($A232,Filtro!$A$5:$K$272,4,FALSE),0)","v":0},{"$f":"IFERROR(VLOOKUP($A232,Filtro!$A$5:$K$272,5,FALSE),0)","v":0}]
["80305058","0305058","Cultivo mixto de linfocitos",0,{"$f":"IFERROR(VLOOKUP($A233,Filtro!$A$5:$K$272,3,FALSE),0)","v":0},{"$f":"IFERROR(VLOOKUP($A233,Filtro!$A$5:$K$272,4,FALSE),0)","v":0},{"$f":"IFERROR(VLOOKUP($A233,Filtro!$A$5:$K$272,5,FALSE),0)","v":0}]
["80305059","0305059","Identificación de clase de inmunoglobulinas de auto o alo cross match positivo",0,{"$f":"IFERROR(VLOOKUP($A234,Filtro!$A$5:$K$272,3,FALSE),0)","v":0},{"$f":"IFERROR(VLOOKUP($A234,Filtro!$A$5:$K$272,4,FALSE),0)","v":0},{"$f":"IFERROR(VLOOKUP($A234,Filtro!$A$5:$K$272,5,FALSE),0)","v":0}]
["80305060","0305060","Tipificación HLA B-27",0,{"$f":"IFERROR(VLOOKUP($A235,Filtro!$A$5:$K$272,3,FALSE),0)","v":0},{"$f":"IFERROR(VLOOKUP($A235,Filtro!$A$5:$K$272,4,FALSE),0)","v":0},{"$f":"IFERROR(VLOOKUP($A235,Filtro!$A$5:$K$272,5,FALSE),0)","v":0}]
["80305061","0305061","Tipificación HLA B-8",0,{"$f":"IFERROR(VLOOKUP($A236,Filtro!$A$5:$K$272,3,FALSE),0)","v":0},{"$f":"IFERROR(VLOOKUP($A236,Filtro!$A$5:$K$272,4,FALSE),0)","v":0},{"$f":"IFERROR(VLOOKUP($A236,Filtro!$A$5:$K$272,5,FALSE),0)","v":0}]
["80305062","0305062","Tipificación HLA  - DR serológica",0,{"$f":"IFERROR(VLOOKUP($A237,Filtro!$A$5:$K$272,3,FALSE),0)","v":0},{"$f":"IFERROR(VLOOKUP($A237,Filtro!$A$5:$K$272,4,FALSE),0)","v":0},{"$f":"IFERROR(VLOOKUP($A237,Filtro!$A$5:$K$272,5,FALSE),0)","v":0}]
["80305063","0305063","Tipificación HLA - A, B serológica",0,{"$f":"IFERROR(VLOOKUP($A238,Filtro!$A$5:$K$272,3,FALSE),0)","v":0},{"$f":"IFERROR(VLOOKUP($A238,Filtro!$A$5:$K$272,4,FALSE),0)","v":0},{"$f":"IFERROR(VLOOKUP($A238,Filtro!$A$5:$K$272,5,FALSE),0)","v":0}]
[null,"TOTAL",null,{"$f":"SUM(D182:D238)","v":579},{"$f":"SUM(E182:E238)","v":0},{"$f":"SUM(F182:F238)","v":579},{"$f":"SUM(G182:G238)","v":{"v":2281,"d":"2,281"}}]
[]
[null,"MICROBIOLÓGICOS"]
["80306001","0306001","Baciloscopía Ziehl-Neelsen por concentración de líquidos (orina u otros), c/u",{"$f":"SUM(E242:F242)","v":0},{"$f":"IFERROR(VLOOKUP($A242,Filtro!$A$5:$K$272,3,FALSE),0)","v":0},{"$f":"IFERROR(VLOOKUP($A242,Filtro!$A$5:$K$272,4,FALSE),0)","v":0},{"$f":"IFERROR(VLOOKUP($A242,Filtro!$A$5:$K$272,5,FALSE),0)","v":34}]
["80306002","0306002","Baciloscopía Ziehl-Neelsen, c/u",{"$f":"SUM(E243:F243)","v":0},{"$f":"IFERROR(VLOOKUP($A243,Filtro!$A$5:$K$272,3,FALSE),0)","v":0},{"$f":"IFERROR(VLOOKUP($A243,Filtro!$A$5:$K$272,4,FALSE),0)","v":0},{"$f":"IFERROR(VLOOKUP($A243,Filtro!$A$5:$K$272,5,FALSE),0)","v":172}]
["80306004","0306004","Examen directo al fresco, c/s tinción (incluye trichomonas)",8,{"$f":"IFERROR(VLOOKUP($A244,Filtro!$A$5:$K$272,3,FALSE),0)","v":0},{"$f":"IFERROR(VLOOKUP($A244,Filtro!$A$5:$K$272,4,FALSE),0)","v":8},{"$f":"IFERROR(VLOOKUP($A244,Filtro!$A$5:$K$272,5,FALSE),0)","v":0}]
["80306005","0306005","Tinción de Gram",56,{"$f":"IFERROR(VLOOKUP($A245,Filtro!$A$5:$K$272,3,FALSE),0)","v":0},{"$f":"IFERROR(VLOOKUP($A245,Filtro!$A$5:$K$272,4,FALSE),0)","v":56},{"$f":"IFERROR(VLOOKUP($A245,Filtro!$A$5:$K$272,5,FALSE),0)","v":0}]
["80306006","0306006","Ultramicroscopía (incluye toma de muestras)",0,{"$f":"IFERROR(VLOOKUP($A246,Filtro!$A$5:$K$272,3,FALSE),0)","v":0},{"$f":"IFERROR(VLOOKUP($A246,Filtro!$A$5:$K$272,4,FALSE),0)","v":0},{"$f":"IFERROR(VLOOKUP($A246,Filtro!$A$5:$K$272,5,FALSE),0)","v":0}]
["80306007","0306007","Coprocultivo, c/u",42,{"$f":"IFERROR(VLOOKUP($A247,Filtro!$A$5:$K$272,3,FALSE),0)","v":0},{"$f":"IFERROR(VLOOKUP($A247,Filtro!$A$5:$K$272,4,FALSE),0)","v":42},{"$f":"IFERROR(VLOOKUP($A247,Filtro!$A$5:$K$272,5,FALSE),0)","v":29}]
["80306008","0306008","Corriente (excepto coprocultivo, hemocultivo y urocultivo) c/u",56,{"$f":"IFERROR(VLOOKUP($A248,Filtro!$A$5:$K$272,3,FALSE),0)","v":0},{"$f":"IFERROR(VLOOKUP($A248,Filtro!$A$5:$K$272,4,FALSE),0)","v":56},{"$f":"IFERROR(VLOOKUP($A248,Filtro!$A$5:$K$272,5,FALSE),0)","v":11}]
["80306009","0306009","Hemocultivo aerobio, c/u",0,{"$f":"IFERROR(VLOOKUP($A249,Filtro!$A$5:$K$272,3,FALSE),0)","v":0},{"$f":"IFERROR(VLOOKUP($A249,Filtro!$A$5:$K$272,4,FALSE),0)","v":0},{"$f":"IFERROR(VLOOKUP($A249,Filtro!$A$5:$K$272,5,FALSE),0)","v":0}]
["80306010","0306010","Hemocultivo anaerobio, c/u",0,{"$f":"IFERROR(VLOOKUP($A250,Filtro!$A$5:$K$272,3,FALSE),0)","v":0},{"$f":"IFERROR(VLOOKUP($A250,Filtro!$A$5:$K$272,4,FALSE),0)","v":0},{"$f":"IFERROR(VLOOKUP($A250,Filtro!$A$5:$K$272,5,FALSE),0)","v":0}]
["80306011","0306011","Urocultivo, recuento de colonias y antibiograma (cualquier técnica) (incluye toma de orina aséptica) (no incluye recolector pediátrico)",{"v":1973,"d":"1,973"},{"$f":"IFERROR(VLOOKUP($A251,Filtro!$A$5:$K$272,3,FALSE),0)","v":0},{"$f":"IFERROR(VLOOKUP($A251,Filtro!$A$5:$K$272,4,FALSE),0)","v":{"v":1973,"d":"1,973"}},{"$f":"IFERROR(VLOOKUP($A251,Filtro!$A$5:$K$272,5,FALSE),0)","v":{"v":3320,"d":"3,320"}}]
["80306012","0306012","Anaerobios (incluye cód. 03-06-008)",0,{"$f":"IFERROR(VLOOKUP($A252,Filtro!$A$5:$K$272,3,FALSE),0)","v":0},{"$f":"IFERROR(VLOOKUP($A252,Filtro!$A$5:$K$272,4,FALSE),0)","v":0},{"$f":"IFERROR(VLOOKUP($A252,Filtro!$A$5:$K$272,5,FALSE),0)","v":0}]
["80306013","0306013","Cultivo específico para Bordetella",0,{"$f":"IFERROR(VLOOKUP($A253,Filtro!$A$5:$K$272,3,FALSE),0)","v":0},{"$f":"IFERROR(VLOOKUP($A253,Filtro!$A$5:$K$272,4,FALSE),0)","v":0},{"$f":"IFERROR(VLOOKUP($A253,Filtro!$A$5:$K$272,5,FALSE),0)","v":0}]
["80306014","0306014","Cultivo para Campylobacter, Yersinia, Vibrio, c/u",0,{"$f":"IFERROR(VLOOKUP($A254,Filtro!$A$5:$K$272,3,FALSE),0)","v":0},{"$f":"IFERROR(VLOOKUP($A254,Filtro!$A$5:$K$272,4,FALSE),0)","v":0},{"$f":"IFERROR(VLOOKUP($A254,Filtro!$A$5:$K$272,5,FALSE),0)","v":0}]
["80306015","0306015","Difteria",0,{"$f":"IFERROR(VLOOKUP($A255,Filtro!$A$5:$K$272,3,FALSE),0)","v":0},{"$f":"IFERROR(VLOOKUP($A255,Filtro!$A$5:$K$272,4,FALSE),0)","v":0},{"$f":"IFERROR(VLOOKUP($A255,Filtro!$A$5:$K$272,5,FALSE),0)","v":0}]
["80306016","0306016","Neisseria gonorrhoeae (gonococo)",0,{"$f":"IFERROR(VLOOKUP($A256,Filtro!$A$5:$K$272,3,FALSE),0)","v":0},{"$f":"IFERROR(VLOOKUP($A256,Filtro!$A$5:$K$272,4,FALSE),0)","v":0},{"$f":"IFERROR(VLOOKUP($A256,Filtro!$A$5:$K$272,5,FALSE),0)","v":0}]
["80306017","0306017","Cultivo para Levaduras",0,{"$f":"IFERROR(VLOOKUP($A257,Filtro!$A$5:$K$272,3,FALSE),0)","v":0},{"$f":"IFERROR(VLOOKUP($A257,Filtro!$A$5:$K$272,4,FALSE),0)","v":0},{"$f":"IFERROR(VLOOKUP($A257,Filtro!$A$5:$K$272,5,FALSE),0)","v":0}]
["80306117","0306117","Hongos Filamentosos",8,{"$f":"IFERROR(VLOOKUP($A258,Filtro!$A$5:$K$272,3,FALSE),0)","v":0},{"$f":"IFERROR(VLOOKUP($A258,Filtro!$A$5:$K$272,4,FALSE),0)","v":8},{"$f":"IFERROR(VLOOKUP($A258,Filtro!$A$5:$K$272,5,FALSE),0)","v":0}]
["80306018","0306018","Cultivo para bacilo de Koch, (incluye otras micobacterias)",0,{"$f":"IFERROR(VLOOKUP($A259,Filtro!$A$5:$K$272,3,FALSE),0)","v":0},{"$f":"IFERROR(VLOOKUP($A259,Filtro!$A$5:$K$272,4,FALSE),0)","v":0},{"$f":"IFERROR(VLOOKUP($A259,Filtro!$A$5:$K$272,5,FALSE),0)","v":9}]
["80306019","0306019","Cultivo para Legionella",0,{"$f":"IFERROR(VLOOKUP($A260,Filtro!$A$5:$K$272,3,FALSE),0)","v":0},{"$f":"IFERROR(VLOOKUP($A260,Filtro!$A$5:$K$272,4,FALSE),0)","v":0},{"$f":"IFERROR(VLOOKUP($A260,Filtro!$A$5:$K$272,5,FALSE),0)","v":0}]
["80306020","0306020","Listeria",0,{"$f":"IFERROR(VLOOKUP($A261,Filtro!$A$5:$K$272,3,FALSE),0)","v":0},{"$f":"IFERROR(VLOOKUP($A261,Filtro!$A$5:$K$272,4,FALSE),0)","v":0},{"$f":"IFERROR(VLOOKUP($A261,Filtro!$A$5:$K$272,5,FALSE),0)","v":0}]
["80306021","0306021","Neisseria meningitidis (meningococo)",0,{"$f":"IFERROR(VLOOKUP($A262,Filtro!$A$5:$K$272,3,FALSE),0)","v":0},{"$f":"IFERROR(VLOOKUP($A262,Filtro!$A$5:$K$272,4,FALSE),0)","v":0},{"$f":"IFERROR(VLOOKUP($A262,Filtro!$A$5:$K$272,5,FALSE),0)","v":0}]
["80306022","0306022","Cultivo y Tipificación de micobacterias",0,{"$f":"IFERROR(VLOOKUP($A263,Filtro!$A$5:$K$272,3,FALSE),0)","v":0},{"$f":"IFERROR(VLOOKUP($A263,Filtro!$A$5:$K$272,4,FALSE),0)","v":0},{"$f":"IFERROR(VLOOKUP($A263,Filtro!$A$5:$K$272,5,FALSE),0)","v":1}]
["80306023","0306023","Mycoplasma y Ureaplasma, c/u",0,{"$f":"IFERROR(VLOOKUP($A264,Filtro!$A$5:$K$272,3,FALSE),0)","v":0},{"$f":"IFERROR(VLOOKUP($A264,Filtro!$A$5:$K$272,4,FALSE),0)","v":0},{"$f":"IFERROR(VLOOKUP($A264,Filtro!$A$5:$K$272,5,FALSE),0)","v":0}]
["80306024","0306024","Anaerobios  (mínimo 4 fármacos)",0,{"$f":"IFERROR(VLOOKUP($A265,Filtro!$A$5:$K$272,3,FALSE),0)","v":0},{"$f":"IFERROR(VLOOKUP($A265,Filtro!$A$5:$K$272,4,FALSE),0)","v":0},{"$f":"IFERROR(VLOOKUP($A265,Filtro!$A$5:$K$272,5,FALSE),0)","v":0}]
["80306025","0306025","Bacilo de Koch (cada fármaco)",0,{"$f":"IFERROR(VLOOKUP($A266,Filtro!$A$5:$K$272,3,FALSE),0)","v":0},{"$f":"IFERROR(VLOOKUP($A266,Filtro!$A$5:$K$272,4,FALSE),0)","v":0},{"$f":"IFERROR(VLOOKUP($A266,Filtro!$A$5:$K$272,5,FALSE),0)","v":0}]
["80306026","0306026","Corriente (mínimo 10 fármacos) (en caso de urocultivo no corresponde su cobro; incluido en el valor 03-06-011)",373,{"$f":"IFERROR(VLOOKUP($A267,Filtro!$A$5:$K$272,3,FALSE),0)","v":0},{"$f":"IFERROR(VLOOKUP($A267,Filtro!$A$5:$K$272,4,FALSE),0)","v":373},{"$f":"IFERROR(VLOOKUP($A267,Filtro!$A$5:$K$272,5,FALSE),0)","v":0}]
["80306027","0306027","Estudio de sensibilidad por dilución (CIM) (mínimo 6 fármacos) (en caso de urocultivo, no corresponde su cobro; incluido en el valor código 03-06-011)",0,{"$f":"IFERROR(VLOOKUP($A268,Filtro!$A$5:$K$272,3,FALSE),0)","v":0},{"$f":"IFERROR(VLOOKUP($A268,Filtro!$A$5:$K$272,4,FALSE),0)","v":0},{"$f":"IFERROR(VLOOKUP($A268,Filtro!$A$5:$K$272,5,FALSE),0)","v":0}]
["80306028","0306028","Antifungigrama (mínimo 4 fármacos antihongos)",0,{"$f":"IFERROR(VLOOKUP($A269,Filtro!$A$5:$K$272,3,FALSE),0)","v":0},{"$f":"IFERROR(VLOOKUP($A269,Filtro!$A$5:$K$272,4,FALSE),0)","v":0},{"$f":"IFERROR(VLOOKUP($A269,Filtro!$A$5:$K$272,5,FALSE),0)","v":0}]
["80306029","0306029","Autovacunas, incluye cultivo y preparación  de mínimo 10 ampollas",0,{"$f":"IFERROR(VLOOKUP($A270,Filtro!$A$5:$K$272,3,FALSE),0)","v":0},{"$f":"IFERROR(VLOOKUP($A270,Filtro!$A$5:$K$272,4,FALSE),0)","v":0},{"$f":"IFERROR(VLOOKUP($A270,Filtro!$A$5:$K$272,5,FALSE),0)","v":0}]
["80306030","0306030","Poder bactericida del suero",0,{"$f":"IFERROR(VLOOKUP($A271,Filtro!$A$5:$K$272,3,FALSE),0)","v":0},{"$f":"IFERROR(VLOOKUP($A271,Filtro!$A$5:$K$272,4,FALSE),0)","v":0},{"$f":"IFERROR(VLOOKUP($A271,Filtro!$A$5:$K$272,5,FALSE),0)","v":0}]
["80306031","0306031","Preparación de vacunas uni o polivalentes mantenidas en stock (mínimo 5 ampollas)",0,{"$f":"IFERROR(VLOOKUP($A272,Filtro!$A$5:$K$272,3,FALSE),0)","v":0},{"$f":"IFERROR(VLOOKUP($A272,Filtro!$A$5:$K$272,4,FALSE),0)","v":0},{"$f":"IFERROR(VLOOKUP($A272,Filtro!$A$5:$K$272,5,FALSE),0)","v":0}]
["80306032","0306032","Aspergilosis, candidiasis, histoplasmosis u otros hongos por inmunodiagnóstico c/u",0,{"$f":"IFERROR(VLOOKUP($A273,Filtro!$A$5:$K$272,3,FALSE),0)","v":0},{"$f":"IFERROR(VLOOKUP($A273,Filtro!$A$5:$K$272,4,FALSE),0)","v":0},{"$f":"IFERROR(VLOOKUP($A273,Filtro!$A$5:$K$272,5,FALSE),0)","v":0}]
["80306033","0306033","Brucella, reacción de aglutinación para (Wright-Hudleson) o similares",0,{"$f":"IFERROR(VLOOKUP($A274,Filtro!$A$5:$K$272,3,FALSE),0)","v":0},{"$f":"IFERROR(VLOOKUP($A274,Filtro!$A$5:$K$272,4,FALSE),0)","v":0},{"$f":"IFERROR(VLOOKUP($A274,Filtro!$A$5:$K$272,5,FALSE),0)","v":0}]
["80306034","0306034","Clamidias por inmunofluorescencia, peroxidasa, Elisa o similares",0,{"$f":"IFERROR(VLOOKUP($A275,Filtro!$A$5:$K$272,3,FALSE),0)","v":0},{"$f":"IFERROR(VLOOKUP($A275,Filtro!$A$5:$K$272,4,FALSE),0)","v":0},{"$f":"IFERROR(VLOOKUP($A275,Filtro!$A$5:$K$272,5,FALSE),0)","v":0}]
["80306036","0306036","Mononucleosis, reacción de Paul Bunnell, Anticuerpos Heterófilos o similares",0,{"$f":"IFERROR(VLOOKUP($A276,Filtro!$A$5:$K$272,3,FALSE),0)","v":0},{"$f":"IFERROR(VLOOKUP($A276,Filtro!$A$5:$K$272,4,FALSE),0)","v":0},{"$f":"IFERROR(VLOOKUP($A276,Filtro!$A$5:$K$272,5,FALSE),0)","v":0}]
["80306037","0306037","Mycoplasma IgG, IgM, c/u. ",0,{"$f":"IFERROR(VLOOKUP($A277,Filtro!$A$5:$K$272,3,FALSE),0)","v":0},{"$f":"IFERROR(VLOOKUP($A277,Filtro!$A$5:$K$272,4,FALSE),0)","v":0},{"$f":"IFERROR(VLOOKUP($A277,Filtro!$A$5:$K$272,5,FALSE),0)","v":0}]
["80306038","0306038","R.P.R.",{"v":1142,"d":"1,142"},{"$f":"IFERROR(VLOOKUP($A278,Filtro!$A$5:$K$272,3,FALSE),0)","v":0},{"$f":"IFERROR(VLOOKUP($A278,Filtro!$A$5:$K$272,4,FALSE),0)","v":{"v":1142,"d":"1,142"}},{"$f":"IFERROR(VLOOKUP($A278,Filtro!$A$5:$K$272,5,FALSE),0)","v":{"v":1010,"d":"1,010"}}]
["80306039","0306039","Tíficas, reacciones de aglutinación  (Eberth H y O, paratyphi A y B) (Widal)",0,{"$f":"IFERROR(VLOOKUP($A279,Filtro!$A$5:$K$272,3,FALSE),0)","v":0},{"$f":"IFERROR(VLOOKUP($A279,Filtro!$A$5:$K$272,4,FALSE),0)","v":0},{"$f":"IFERROR(VLOOKUP($A279,Filtro!$A$5:$K$272,5,FALSE),0)","v":0}]
["80306041","0306041","Treponema pallidum FTA - ABS, MHA-TP c/u",0,{"$f":"IFERROR(VLOOKUP($A280,Filtro!$A$5:$K$272,3,FALSE),0)","v":0},{"$f":"IFERROR(VLOOKUP($A280,Filtro!$A$5:$K$272,4,FALSE),0)","v":0},{"$f":"IFERROR(VLOOKUP($A280,Filtro!$A$5:$K$272,5,FALSE),0)","v":2}]
["80306042","0306042","V.D.R.L.",174,{"$f":"IFERROR(VLOOKUP($A281,Filtro!$A$5:$K$272,3,FALSE),0)","v":0},{"$f":"IFERROR(VLOOKUP($A281,Filtro!$A$5:$K$272,4,FALSE),0)","v":174},{"$f":"IFERROR(VLOOKUP($A281,Filtro!$A$5:$K$272,5,FALSE),0)","v":{"v":2309,"d":"2,309"}}]
["80306043","0306043","Artrópodos macroscópicos y microscópicos (imagos y/o pupas y/o larvas), diagnóstico de",0,{"$f":"IFERROR(VLOOKUP($A282,Filtro!$A$5:$K$272,3,FALSE),0)","v":0},{"$f":"IFERROR(VLOOKUP($A282,Filtro!$A$5:$K$272,4,FALSE),0)","v":0},{"$f":"IFERROR(VLOOKUP($A282,Filtro!$A$5:$K$272,5,FALSE),0)","v":0}]
["80306045","0306045","Coproparasitario seriado con técnica  para Cryptosporidium sp o para Diantamoeba fragilis (incluye los códigos 03-06-048 y/o 03-06-059 más aplicación de técnica de frotis con tinción tricrómica o tinción Ziehl-Neelsen en por lo menos 3 muestras, según corresponda)",0,{"$f":"IFERROR(VLOOKUP($A283,Filtro!$A$5:$K$272,3,FALSE),0)","v":0},{"$f":"IFERROR(VLOOKUP($A283,Filtro!$A$5:$K$272,4,FALSE),0)","v":0},{"$f":"IFERROR(VLOOKUP($A283,Filtro!$A$5:$K$272,5,FALSE),0)","v":2}]
["80306046","0306046","Coproparasitario seriado para Fasciola hepática (incluye diagnostico de gusanos macroscópicos y ex. microscópico de 10 muestras separadas por método de Telemann y de otras 10 muestras separadas y simultáneas con las ant. por téc. de sedimentación)",0,{"$f":"IFERROR(VLOOKUP($A284,Filtro!$A$5:$K$272,3,FALSE),0)","v":0},{"$f":"IFERROR(VLOOKUP($A284,Filtro!$A$5:$K$272,4,FALSE),0)","v":0},{"$f":"IFERROR(VLOOKUP($A284,Filtro!$A$5:$K$272,5,FALSE),0)","v":0}]
["80306047","0306047","Coproparasitario seriado para Isospora y Sarcocystis (incluye diagnóstico de gusanos macroscópicos y examen  microscópico de 3 muestras separadas)",0,{"$f":"IFERROR(VLOOKUP($A285,Filtro!$A$5:$K$272,3,FALSE),0)","v":0},{"$f":"IFERROR(VLOOKUP($A285,Filtro!$A$5:$K$272,4,FALSE),0)","v":0},{"$f":"IFERROR(VLOOKUP($A285,Filtro!$A$5:$K$272,5,FALSE),0)","v":15}]
["80306048","0306048","Coproparasitológico seriado simple (incluye diagnostico de gusanos macroscópicos y examen microscópico por concentración de 3 muestras separadas método Telemann) (proc. aut.)",51,{"$f":"IFERROR(VLOOKUP($A286,Filtro!$A$5:$K$272,3,FALSE),0)","v":0},{"$f":"IFERROR(VLOOKUP($A286,Filtro!$A$5:$K$272,4,FALSE),0)","v":51},{"$f":"IFERROR(VLOOKUP($A286,Filtro!$A$5:$K$272,5,FALSE),0)","v":142}]
["80306049","0306049","Diagnostico de parásitos en jugo duodenal y/o bilis, examen macroscópico y microscópico (directo y/o concentración, c/s tinción)",0,{"$f":"IFERROR(VLOOKUP($A287,Filtro!$A$5:$K$272,3,FALSE),0)","v":0},{"$f":"IFERROR(VLOOKUP($A287,Filtro!$A$5:$K$272,4,FALSE),0)","v":0},{"$f":"IFERROR(VLOOKUP($A287,Filtro!$A$5:$K$272,5,FALSE),0)","v":20}]
["80306050","0306050","Diagnostico parasitario en exudados, secreciones y otros líquidos orgánicos (no especificados mas adelante), examen macro y microscópico de (incluye concentración y/o tinción cuando proceda), c/u",0,{"$f":"IFERROR(VLOOKUP($A288,Filtro!$A$5:$K$272,3,FALSE),0)","v":0},{"$f":"IFERROR(VLOOKUP($A288,Filtro!$A$5:$K$272,4,FALSE),0)","v":0},{"$f":"IFERROR(VLOOKUP($A288,Filtro!$A$5:$K$272,5,FALSE),0)","v":0}]
["80306051","0306051","Graham, examen de (incluye diagnostico de gusanos macroscópicos y examen microscópico de 5 muestras separadas)",29,{"$f":"IFERROR(VLOOKUP($A289,Filtro!$A$5:$K$272,3,FALSE),0)","v":0},{"$f":"IFERROR(VLOOKUP($A289,Filtro!$A$5:$K$272,4,FALSE),0)","v":29},{"$f":"IFERROR(VLOOKUP($A289,Filtro!$A$5:$K$272,5,FALSE),0)","v":52}]
["80306052","0306052","Gusanos macroscópicos, diagnóstico de (proc. aut.)",0,{"$f":"IFERROR(VLOOKUP($A290,Filtro!$A$5:$K$272,3,FALSE),0)","v":0},{"$f":"IFERROR(VLOOKUP($A290,Filtro!$A$5:$K$272,4,FALSE),0)","v":0},{"$f":"IFERROR(VLOOKUP($A290,Filtro!$A$5:$K$272,5,FALSE),0)","v":15}]
["80306053","0306053","Hemoparásitos, diagnóstico microscópico de (mínimo 10 frotis y/o gotas gruesas, c/s examen directo al fresco), cada sesión",0,{"$f":"IFERROR(VLOOKUP($A291,Filtro!$A$5:$K$272,3,FALSE),0)","v":0},{"$f":"IFERROR(VLOOKUP($A291,Filtro!$A$5:$K$272,4,FALSE),0)","v":0},{"$f":"IFERROR(VLOOKUP($A291,Filtro!$A$5:$K$272,5,FALSE),0)","v":0}]
["80306054","0306054","Hemoparásitos, diagnóstico por técnica de Strout o similar en hasta 10 tubos capilares, cada sesión",0,{"$f":"IFERROR(VLOOKUP($A292,Filtro!$A$5:$K$272,3,FALSE),0)","v":0},{"$f":"IFERROR(VLOOKUP($A292,Filtro!$A$5:$K$272,4,FALSE),0)","v":0},{"$f":"IFERROR(VLOOKUP($A292,Filtro!$A$5:$K$272,5,FALSE),0)","v":0}]
["80306056","0306056","Raspado de piel, examen microscópico de (\"Acarotest\"): de 6 a 10 preparaciones",0,{"$f":"IFERROR(VLOOKUP($A293,Filtro!$A$5:$K$272,3,FALSE),0)","v":0},{"$f":"IFERROR(VLOOKUP($A293,Filtro!$A$5:$K$272,4,FALSE),0)","v":0},{"$f":"IFERROR(VLOOKUP($A293,Filtro!$A$5:$K$272,5,FALSE),0)","v":0}]
["80306057","0306057","Tenias post. trat., Diagnostico y búsqueda de escólex de",0,{"$f":"IFERROR(VLOOKUP($A294,Filtro!$A$5:$K$272,3,FALSE),0)","v":0},{"$f":"IFERROR(VLOOKUP($A294,Filtro!$A$5:$K$272,4,FALSE),0)","v":0},{"$f":"IFERROR(VLOOKUP($A294,Filtro!$A$5:$K$272,5,FALSE),0)","v":0}]
["80306058","0306058","Xenodiagnóstico (cada aplicación de 2 cajas, con 6 ninfas por lo menos c/u, examinadas a los 20 y/o 30 días y hasta por 60 días más si procede)",0,{"$f":"IFERROR(VLOOKUP($A295,Filtro!$A$5:$K$272,3,FALSE),0)","v":0},{"$f":"IFERROR(VLOOKUP($A295,Filtro!$A$5:$K$272,4,FALSE),0)","v":0},{"$f":"IFERROR(VLOOKUP($A295,Filtro!$A$5:$K$272,5,FALSE),0)","v":0}]
["80306059","0306059","Coproparasitológico seriado simple (incluye diagnóstico de gusanos macroscopicos  y exámen microscopico por concentración de tres muestras separadas método PAFS (proc. aut.)",49,{"$f":"IFERROR(VLOOKUP($A296,Filtro!$A$5:$K$272,3,FALSE),0)","v":0},{"$f":"IFERROR(VLOOKUP($A296,Filtro!$A$5:$K$272,4,FALSE),0)","v":49},{"$f":"IFERROR(VLOOKUP($A296,Filtro!$A$5:$K$272,5,FALSE),0)","v":1}]
["80306061","0306061","Elisa indirecta (Chagas, hidatidosis, toxocariasis y otras), c/u",308,{"$f":"IFERROR(VLOOKUP($A297,Filtro!$A$5:$K$272,3,FALSE),0)","v":0},{"$f":"IFERROR(VLOOKUP($A297,Filtro!$A$5:$K$272,4,FALSE),0)","v":308},{"$f":"IFERROR(VLOOKUP($A297,Filtro!$A$5:$K$272,5,FALSE),0)","v":784}]
["80306062","0306062","Fijación del complemento (distomatosis, toxoplasmosis, cisticercosis y otras) c/u",0,{"$f":"IFERROR(VLOOKUP($A298,Filtro!$A$5:$K$272,3,FALSE),0)","v":0},{"$f":"IFERROR(VLOOKUP($A298,Filtro!$A$5:$K$272,4,FALSE),0)","v":0},{"$f":"IFERROR(VLOOKUP($A298,Filtro!$A$5:$K$272,5,FALSE),0)","v":0}]
["80306063","0306063","Floculación en bentonita, látex, precipitinas o similar (triquinosis, hidatidosis y otros), c/u",0,{"$f":"IFERROR(VLOOKUP($A299,Filtro!$A$5:$K$272,3,FALSE),0)","v":0},{"$f":"IFERROR(VLOOKUP($A299,Filtro!$A$5:$K$272,4,FALSE),0)","v":0},{"$f":"IFERROR(VLOOKUP($A299,Filtro!$A$5:$K$272,5,FALSE),0)","v":0}]
["80306064","0306064","Hemaglutinación indirecta (toxoplasmosis, Chagas, hidatidosis y otras), c/u",0,{"$f":"IFERROR(VLOOKUP($A300,Filtro!$A$5:$K$272,3,FALSE),0)","v":0},{"$f":"IFERROR(VLOOKUP($A300,Filtro!$A$5:$K$272,4,FALSE),0)","v":0},{"$f":"IFERROR(VLOOKUP($A300,Filtro!$A$5:$K$272,5,FALSE),0)","v":3}]
["80306065","0306065","Inmunoelectroforesis o contrainmunoelectroforesis (hidatidosis, distomatosis, amebiasis y otras), c/u",0,{"$f":"IFERROR(VLOOKUP($A301,Filtro!$A$5:$K$272,3,FALSE),0)","v":0},{"$f":"IFERROR(VLOOKUP($A301,Filtro!$A$5:$K$272,4,FALSE),0)","v":0},{"$f":"IFERROR(VLOOKUP($A301,Filtro!$A$5:$K$272,5,FALSE),0)","v":0}]
["80306066","0306066","Inmunofluorescencia indirecta (toxoplasmosis, Chagas, amebiasis y otras), c/u",0,{"$f":"IFERROR(VLOOKUP($A302,Filtro!$A$5:$K$272,3,FALSE),0)","v":0},{"$f":"IFERROR(VLOOKUP($A302,Filtro!$A$5:$K$272,4,FALSE),0)","v":0},{"$f":"IFERROR(VLOOKUP($A302,Filtro!$A$5:$K$272,5,FALSE),0)","v":5}]
["80306067","0306067","Reacción intradérmica (incluye el valor y la aplicación del antígeno y del control y examen de las reacciones inmediatas y retardadas, cada antígeno) (bachmann, distomatosis u otras)",0,{"$f":"IFERROR(VLOOKUP($A303,Filtro!$A$5:$K$272,3,FALSE),0)","v":0},{"$f":"IFERROR(VLOOKUP($A303,Filtro!$A$5:$K$272,4,FALSE),0)","v":0},{"$f":"IFERROR(VLOOKUP($A303,Filtro!$A$5:$K$272,5,FALSE),0)","v":0}]
["80306068","0306068","Aislamiento de virus (adenovirus, citomegalovirus, Coxsakie, herpes, influenza, polio, sarampión y otros), c/u",0,{"$f":"IFERROR(VLOOKUP($A304,Filtro!$A$5:$K$272,3,FALSE),0)","v":0},{"$f":"IFERROR(VLOOKUP($A304,Filtro!$A$5:$K$272,4,FALSE),0)","v":0},{"$f":"IFERROR(VLOOKUP($A304,Filtro!$A$5:$K$272,5,FALSE),0)","v":0}]
["80306069","0306069","Anticuerpos virales, determ. de (adenovirus, citomegalovirus, herpes simple, rubéola, Influenza  A y B; virus varicela-zoster; virus sincicial respiratorio; parainfluenza 1, 2 y 3, Epstein Barr y otros), c/u",0,{"$f":"IFERROR(VLOOKUP($A305,Filtro!$A$5:$K$272,3,FALSE),0)","v":0},{"$f":"IFERROR(VLOOKUP($A305,Filtro!$A$5:$K$272,4,FALSE),0)","v":0},{"$f":"IFERROR(VLOOKUP($A305,Filtro!$A$5:$K$272,5,FALSE),0)","v":0}]
["80306169","0306169","Anticuerpos virales, determ. de H.I.V.",4,{"$f":"IFERROR(VLOOKUP($A306,Filtro!$A$5:$K$272,3,FALSE),0)","v":0},{"$f":"IFERROR(VLOOKUP($A306,Filtro!$A$5:$K$272,4,FALSE),0)","v":4},{"$f":"IFERROR(VLOOKUP($A306,Filtro!$A$5:$K$272,5,FALSE),0)","v":328}]
["80306070","0306070","Antígenos virales determ. de (adenovirus, citomegalovirus, herpes simple, rubéola, influenza y otros), (por cualquier técnica ej: inmunofluorescencia), c/u",{"$f":"SUM(E307:F307)","v":0},{"$f":"IFERROR(VLOOKUP($A307,Filtro!$A$5:$K$272,3,FALSE),0)","v":0},{"$f":"IFERROR(VLOOKUP($A307,Filtro!$A$5:$K$272,4,FALSE),0)","v":0},{"$f":"IFERROR(VLOOKUP($A307,Filtro!$A$5:$K$272,5,FALSE),0)","v":0}]
["80306170","0306170","Antígenos virales determ. de rotavirus, por cualquier técnica ",2,{"$f":"IFERROR(VLOOKUP($A308,Filtro!$A$5:$K$272,3,FALSE),0)","v":0},{"$f":"IFERROR(VLOOKUP($A308,Filtro!$A$5:$K$272,4,FALSE),0)","v":2},{"$f":"IFERROR(VLOOKUP($A308,Filtro!$A$5:$K$272,5,FALSE),0)","v":0}]
["80306270","0306270","Antígenos virales determ. de virus sincicial, por cualquier técnica ",0,{"$f":"IFERROR(VLOOKUP($A309,Filtro!$A$5:$K$272,3,FALSE),0)","v":0},{"$f":"IFERROR(VLOOKUP($A309,Filtro!$A$5:$K$272,4,FALSE),0)","v":0},{"$f":"IFERROR(VLOOKUP($A309,Filtro!$A$5:$K$272,5,FALSE),0)","v":0}]
["80306072","0306072","Reacción de seroneutralización para: virus polio, ECHO, Coxsakie, c/u",0,{"$f":"IFERROR(VLOOKUP($A310,Filtro!$A$5:$K$272,3,FALSE),0)","v":0},{"$f":"IFERROR(VLOOKUP($A310,Filtro!$A$5:$K$272,4,FALSE),0)","v":0},{"$f":"IFERROR(VLOOKUP($A310,Filtro!$A$5:$K$272,5,FALSE),0)","v":0}]
["80306073","0306073","Virus hepatitis A, Anticore",0,{"$f":"IFERROR(VLOOKUP($A311,Filtro!$A$5:$K$272,3,FALSE),0)","v":0},{"$f":"IFERROR(VLOOKUP($A311,Filtro!$A$5:$K$272,4,FALSE),0)","v":0},{"$f":"IFERROR(VLOOKUP($A311,Filtro!$A$5:$K$272,5,FALSE),0)","v":0}]
["80306074","0306074","Virus hepatitis A, anticuerpos IgM del",0,{"$f":"IFERROR(VLOOKUP($A312,Filtro!$A$5:$K$272,3,FALSE),0)","v":0},{"$f":"IFERROR(VLOOKUP($A312,Filtro!$A$5:$K$272,4,FALSE),0)","v":0},{"$f":"IFERROR(VLOOKUP($A312,Filtro!$A$5:$K$272,5,FALSE),0)","v":0}]
["80306075","0306075","Virus hepatitis B, anticuerpo del antígeno E del",0,{"$f":"IFERROR(VLOOKUP($A313,Filtro!$A$5:$K$272,3,FALSE),0)","v":0},{"$f":"IFERROR(VLOOKUP($A313,Filtro!$A$5:$K$272,4,FALSE),0)","v":0},{"$f":"IFERROR(VLOOKUP($A313,Filtro!$A$5:$K$272,5,FALSE),0)","v":62}]
["80306076","0306076","Virus hepatitis B, anticore total del (anti HBc total)",0,{"$f":"IFERROR(VLOOKUP($A314,Filtro!$A$5:$K$272,3,FALSE),0)","v":0},{"$f":"IFERROR(VLOOKUP($A314,Filtro!$A$5:$K$272,4,FALSE),0)","v":0},{"$f":"IFERROR(VLOOKUP($A314,Filtro!$A$5:$K$272,5,FALSE),0)","v":0}]
["80306077","0306077","Virus hepatitis B, anticuerpos de antígeno de superficie (australiano)",1,{"$f":"IFERROR(VLOOKUP($A315,Filtro!$A$5:$K$272,3,FALSE),0)","v":0},{"$f":"IFERROR(VLOOKUP($A315,Filtro!$A$5:$K$272,4,FALSE),0)","v":1},{"$f":"IFERROR(VLOOKUP($A315,Filtro!$A$5:$K$272,5,FALSE),0)","v":4}]
["80306078","0306078","Virus hepatitis B, antígeno E del (HBEAg)",0,{"$f":"IFERROR(VLOOKUP($A316,Filtro!$A$5:$K$272,3,FALSE),0)","v":0},{"$f":"IFERROR(VLOOKUP($A316,Filtro!$A$5:$K$272,4,FALSE),0)","v":0},{"$f":"IFERROR(VLOOKUP($A316,Filtro!$A$5:$K$272,5,FALSE),0)","v":223}]
["80306079","0306079","Virus hepatitis B, antígeno superficie",5,{"$f":"IFERROR(VLOOKUP($A317,Filtro!$A$5:$K$272,3,FALSE),0)","v":0},{"$f":"IFERROR(VLOOKUP($A317,Filtro!$A$5:$K$272,4,FALSE),0)","v":5},{"$f":"IFERROR(VLOOKUP($A317,Filtro!$A$5:$K$272,5,FALSE),0)","v":155}]
["80306080","0306080","Virus hepatitis B, anticore IgM del (anti HBc IgM)",0,{"$f":"IFERROR(VLOOKUP($A318,Filtro!$A$5:$K$272,3,FALSE),0)","v":0},{"$f":"IFERROR(VLOOKUP($A318,Filtro!$A$5:$K$272,4,FALSE),0)","v":0},{"$f":"IFERROR(VLOOKUP($A318,Filtro!$A$5:$K$272,5,FALSE),0)","v":10}]
["80306081","0306081","Virus hepatitis C, anticuerpos de (anti HCV)",0,{"$f":"IFERROR(VLOOKUP($A319,Filtro!$A$5:$K$272,3,FALSE),0)","v":0},{"$f":"IFERROR(VLOOKUP($A319,Filtro!$A$5:$K$272,4,FALSE),0)","v":0},{"$f":"IFERROR(VLOOKUP($A319,Filtro!$A$5:$K$272,5,FALSE),0)","v":10}]
[null,"TOTAL",null,{"$f":"SUM(D242:D319)","v":{"v":4281,"d":"4,281"}},{"$f":"SUM(E242:E319)","v":0},{"$f":"SUM(F242:F319)","v":{"v":4281,"d":"4,281"}},{"$f":"SUM(G242:G319)","v":{"v":8728,"d":"8,728"}}]
[]
[null,"EXÁMENES DE DEPOSICIONES, EXUDADOS, SECRESIONES Y OTROS LÍQUIDOS"]
["80308001","0308001","Azúcares reductores (Benedict-Fehling o similar)",{"$f":"SUM(E323:F323)","v":0},{"$f":"IFERROR(VLOOKUP($A323,Filtro!$A$5:$K$272,3,FALSE),0)","v":0},{"$f":"IFERROR(VLOOKUP($A323,Filtro!$A$5:$K$272,4,FALSE),0)","v":0},{"$f":"IFERROR(VLOOKUP($A323,Filtro!$A$5:$K$272,5,FALSE),0)","v":9}]
["80308002","0308002","Balance graso (Van de Kamer) muestra de tres o más días",{"$f":"SUM(E324:F324)","v":0},{"$f":"IFERROR(VLOOKUP($A324,Filtro!$A$5:$K$272,3,FALSE),0)","v":0},{"$f":"IFERROR(VLOOKUP($A324,Filtro!$A$5:$K$272,4,FALSE),0)","v":0},{"$f":"IFERROR(VLOOKUP($A324,Filtro!$A$5:$K$272,5,FALSE),0)","v":0}]
["80308003","0308003","Grasas neutras (Sudán III)",0,{"$f":"IFERROR(VLOOKUP($A325,Filtro!$A$5:$K$272,3,FALSE),0)","v":0},{"$f":"IFERROR(VLOOKUP($A325,Filtro!$A$5:$K$272,4,FALSE),0)","v":0},{"$f":"IFERROR(VLOOKUP($A325,Filtro!$A$5:$K$272,5,FALSE),0)","v":0}]
["80308004","0308004","Hemorragias ocultas, (bencidina, guayaco o test de Weber y similares), cualquier método, c/muestra",27,{"$f":"IFERROR(VLOOKUP($A326,Filtro!$A$5:$K$272,3,FALSE),0)","v":0},{"$f":"IFERROR(VLOOKUP($A326,Filtro!$A$5:$K$272,4,FALSE),0)","v":27},{"$f":"IFERROR(VLOOKUP($A326,Filtro!$A$5:$K$272,5,FALSE),0)","v":232}]
["80308005","0308005","Leucocitos fecales",18,{"$f":"IFERROR(VLOOKUP($A327,Filtro!$A$5:$K$272,3,FALSE),0)","v":0},{"$f":"IFERROR(VLOOKUP($A327,Filtro!$A$5:$K$272,4,FALSE),0)","v":18},{"$f":"IFERROR(VLOOKUP($A327,Filtro!$A$5:$K$272,5,FALSE),0)","v":25}]
["80308006","0308006","PH",0,{"$f":"IFERROR(VLOOKUP($A328,Filtro!$A$5:$K$272,3,FALSE),0)","v":0},{"$f":"IFERROR(VLOOKUP($A328,Filtro!$A$5:$K$272,4,FALSE),0)","v":0},{"$f":"IFERROR(VLOOKUP($A328,Filtro!$A$5:$K$272,5,FALSE),0)","v":0}]
["80308007","0308007","Porfirinas, c/u",0,{"$f":"IFERROR(VLOOKUP($A329,Filtro!$A$5:$K$272,3,FALSE),0)","v":0},{"$f":"IFERROR(VLOOKUP($A329,Filtro!$A$5:$K$272,4,FALSE),0)","v":0},{"$f":"IFERROR(VLOOKUP($A329,Filtro!$A$5:$K$272,5,FALSE),0)","v":0}]
["80308008","0308008","Urobilinógeno cuantitativo",0,{"$f":"IFERROR(VLOOKUP($A330,Filtro!$A$5:$K$272,3,FALSE),0)","v":0},{"$f":"IFERROR(VLOOKUP($A330,Filtro!$A$5:$K$272,4,FALSE),0)","v":0},{"$f":"IFERROR(VLOOKUP($A330,Filtro!$A$5:$K$272,5,FALSE),0)","v":0}]
["80308009","0308009","Células neoplásicas en fluídos biológicos",0,{"$f":"IFERROR(VLOOKUP($A331,Filtro!$A$5:$K$272,3,FALSE),0)","v":0},{"$f":"IFERROR(VLOOKUP($A331,Filtro!$A$5:$K$272,4,FALSE),0)","v":0},{"$f":"IFERROR(VLOOKUP($A331,Filtro!$A$5:$K$272,5,FALSE),0)","v":0}]
["80308010","0308010","Citológico c/s tinción (incluye examen al fresco, recuento celular y citológico porcentual)",501,{"$f":"IFERROR(VLOOKUP($A332,Filtro!$A$5:$K$272,3,FALSE),0)","v":0},{"$f":"IFERROR(VLOOKUP($A332,Filtro!$A$5:$K$272,4,FALSE),0)","v":501},{"$f":"IFERROR(VLOOKUP($A332,Filtro!$A$5:$K$272,5,FALSE),0)","v":0}]
["80308011","0308011","Directo al fresco c/s tinción, (incluye trichomonas)",0,{"$f":"IFERROR(VLOOKUP($A333,Filtro!$A$5:$K$272,3,FALSE),0)","v":0},{"$f":"IFERROR(VLOOKUP($A333,Filtro!$A$5:$K$272,4,FALSE),0)","v":0},{"$f":"IFERROR(VLOOKUP($A333,Filtro!$A$5:$K$272,5,FALSE),0)","v":0}]
["80308012","0308012","Electrolitos (sodio, potasio, cloro), c/u",0,{"$f":"IFERROR(VLOOKUP($A334,Filtro!$A$5:$K$272,3,FALSE),0)","v":0},{"$f":"IFERROR(VLOOKUP($A334,Filtro!$A$5:$K$272,4,FALSE),0)","v":0},{"$f":"IFERROR(VLOOKUP($A334,Filtro!$A$5:$K$272,5,FALSE),0)","v":0}]
["80308013","0308013","Eosinófilos, recuento de",0,{"$f":"IFERROR(VLOOKUP($A335,Filtro!$A$5:$K$272,3,FALSE),0)","v":0},{"$f":"IFERROR(VLOOKUP($A335,Filtro!$A$5:$K$272,4,FALSE),0)","v":0},{"$f":"IFERROR(VLOOKUP($A335,Filtro!$A$5:$K$272,5,FALSE),0)","v":0}]
["80308014","0308014","Físico-químico (incluye aspecto, color, pH, glucosa, proteína, Pandy y filancia)",0,{"$f":"IFERROR(VLOOKUP($A336,Filtro!$A$5:$K$272,3,FALSE),0)","v":0},{"$f":"IFERROR(VLOOKUP($A336,Filtro!$A$5:$K$272,4,FALSE),0)","v":0},{"$f":"IFERROR(VLOOKUP($A336,Filtro!$A$5:$K$272,5,FALSE),0)","v":0}]
["80308015","0308015","Glucosa en exudados secreciones y otros liquidos",0,{"$f":"IFERROR(VLOOKUP($A337,Filtro!$A$5:$K$272,3,FALSE),0)","v":0},{"$f":"IFERROR(VLOOKUP($A337,Filtro!$A$5:$K$272,4,FALSE),0)","v":0},{"$f":"IFERROR(VLOOKUP($A337,Filtro!$A$5:$K$272,5,FALSE),0)","v":0}]
["80308016","0308016","Mucina, determinación de",0,{"$f":"IFERROR(VLOOKUP($A338,Filtro!$A$5:$K$272,3,FALSE),0)","v":0},{"$f":"IFERROR(VLOOKUP($A338,Filtro!$A$5:$K$272,4,FALSE),0)","v":0},{"$f":"IFERROR(VLOOKUP($A338,Filtro!$A$5:$K$272,5,FALSE),0)","v":0}]
["80308017","0308017","pH, (proc. aut.)",0,{"$f":"IFERROR(VLOOKUP($A339,Filtro!$A$5:$K$272,3,FALSE),0)","v":0},{"$f":"IFERROR(VLOOKUP($A339,Filtro!$A$5:$K$272,4,FALSE),0)","v":0},{"$f":"IFERROR(VLOOKUP($A339,Filtro!$A$5:$K$272,5,FALSE),0)","v":0}]
["80308018","0308018","Proteínas totales o albúmina (proc. aut.) c/u",0,{"$f":"IFERROR(VLOOKUP($A340,Filtro!$A$5:$K$272,3,FALSE),0)","v":0},{"$f":"IFERROR(VLOOKUP($A340,Filtro!$A$5:$K$272,4,FALSE),0)","v":0},{"$f":"IFERROR(VLOOKUP($A340,Filtro!$A$5:$K$272,5,FALSE),0)","v":3}]
["80308019","0308019","Proteínas, electroforesis de (incluye proteínas totales)",0,{"$f":"IFERROR(VLOOKUP($A341,Filtro!$A$5:$K$272,3,FALSE),0)","v":0},{"$f":"IFERROR(VLOOKUP($A341,Filtro!$A$5:$K$272,4,FALSE),0)","v":0},{"$f":"IFERROR(VLOOKUP($A341,Filtro!$A$5:$K$272,5,FALSE),0)","v":0}]
["80308020","0308020","Bandas oligoclonales (incluye electroforesis de L.C.R., suero e inmunofijación)",0,{"$f":"IFERROR(VLOOKUP($A342,Filtro!$A$5:$K$272,3,FALSE),0)","v":0},{"$f":"IFERROR(VLOOKUP($A342,Filtro!$A$5:$K$272,4,FALSE),0)","v":0},{"$f":"IFERROR(VLOOKUP($A342,Filtro!$A$5:$K$272,5,FALSE),0)","v":0}]
["80308021","0308021","Glutamina",0,{"$f":"IFERROR(VLOOKUP($A343,Filtro!$A$5:$K$272,3,FALSE),0)","v":0},{"$f":"IFERROR(VLOOKUP($A343,Filtro!$A$5:$K$272,4,FALSE),0)","v":0},{"$f":"IFERROR(VLOOKUP($A343,Filtro!$A$5:$K$272,5,FALSE),0)","v":0}]
["80308022","0308022","Indice IgG/albúmina (incluye determ. de IgG y albúmina en L.C.R. y suero)",0,{"$f":"IFERROR(VLOOKUP($A344,Filtro!$A$5:$K$272,3,FALSE),0)","v":0},{"$f":"IFERROR(VLOOKUP($A344,Filtro!$A$5:$K$272,4,FALSE),0)","v":0},{"$f":"IFERROR(VLOOKUP($A344,Filtro!$A$5:$K$272,5,FALSE),0)","v":0}]
["80308023","0308023","Estudio de cristales (con luz polarizada)",0,{"$f":"IFERROR(VLOOKUP($A345,Filtro!$A$5:$K$272,3,FALSE),0)","v":0},{"$f":"IFERROR(VLOOKUP($A345,Filtro!$A$5:$K$272,4,FALSE),0)","v":0},{"$f":"IFERROR(VLOOKUP($A345,Filtro!$A$5:$K$272,5,FALSE),0)","v":0}]
["80308024","0308024","Acidez titulable, pH, volumen (una muestra)",0,{"$f":"IFERROR(VLOOKUP($A346,Filtro!$A$5:$K$272,3,FALSE),0)","v":0},{"$f":"IFERROR(VLOOKUP($A346,Filtro!$A$5:$K$272,4,FALSE),0)","v":0},{"$f":"IFERROR(VLOOKUP($A346,Filtro!$A$5:$K$272,5,FALSE),0)","v":0}]
["80308025","0308025","Prueba de estimulación máxima con histamina, mínimo 5 muestras (no incluye la histamina ni el antihistamínico).",0,{"$f":"IFERROR(VLOOKUP($A347,Filtro!$A$5:$K$272,3,FALSE),0)","v":0},{"$f":"IFERROR(VLOOKUP($A347,Filtro!$A$5:$K$272,4,FALSE),0)","v":0},{"$f":"IFERROR(VLOOKUP($A347,Filtro!$A$5:$K$272,5,FALSE),0)","v":0}]
["80308026","0308026","Volumen, anhídrido carbónico, amilasa y lipasa",0,{"$f":"IFERROR(VLOOKUP($A348,Filtro!$A$5:$K$272,3,FALSE),0)","v":0},{"$f":"IFERROR(VLOOKUP($A348,Filtro!$A$5:$K$272,4,FALSE),0)","v":0},{"$f":"IFERROR(VLOOKUP($A348,Filtro!$A$5:$K$272,5,FALSE),0)","v":0}]
["80308027","0308027","Cristales de colesterol",0,{"$f":"IFERROR(VLOOKUP($A349,Filtro!$A$5:$K$272,3,FALSE),0)","v":0},{"$f":"IFERROR(VLOOKUP($A349,Filtro!$A$5:$K$272,4,FALSE),0)","v":0},{"$f":"IFERROR(VLOOKUP($A349,Filtro!$A$5:$K$272,5,FALSE),0)","v":0}]
["80308028","0308028","Lípidos biliares",0,{"$f":"IFERROR(VLOOKUP($A350,Filtro!$A$5:$K$272,3,FALSE),0)","v":0},{"$f":"IFERROR(VLOOKUP($A350,Filtro!$A$5:$K$272,4,FALSE),0)","v":0},{"$f":"IFERROR(VLOOKUP($A350,Filtro!$A$5:$K$272,5,FALSE),0)","v":0}]
["80308029","0308029","Espermiograma (físico y microscópico, con o sin observación hasta 24 horas)",0,{"$f":"IFERROR(VLOOKUP($A351,Filtro!$A$5:$K$272,3,FALSE),0)","v":0},{"$f":"IFERROR(VLOOKUP($A351,Filtro!$A$5:$K$272,4,FALSE),0)","v":0},{"$f":"IFERROR(VLOOKUP($A351,Filtro!$A$5:$K$272,5,FALSE),0)","v":0}]
["80308030","0308030","Fosfatasa ácida prostática",0,{"$f":"IFERROR(VLOOKUP($A352,Filtro!$A$5:$K$272,3,FALSE),0)","v":0},{"$f":"IFERROR(VLOOKUP($A352,Filtro!$A$5:$K$272,4,FALSE),0)","v":0},{"$f":"IFERROR(VLOOKUP($A352,Filtro!$A$5:$K$272,5,FALSE),0)","v":0}]
["80308031","0308031","Fructosa, consumo de",0,{"$f":"IFERROR(VLOOKUP($A353,Filtro!$A$5:$K$272,3,FALSE),0)","v":0},{"$f":"IFERROR(VLOOKUP($A353,Filtro!$A$5:$K$272,4,FALSE),0)","v":0},{"$f":"IFERROR(VLOOKUP($A353,Filtro!$A$5:$K$272,5,FALSE),0)","v":0}]
["80308032","0308032","Bilirrubina                               ",0,{"$f":"IFERROR(VLOOKUP($A354,Filtro!$A$5:$K$272,3,FALSE),0)","v":0},{"$f":"IFERROR(VLOOKUP($A354,Filtro!$A$5:$K$272,4,FALSE),0)","v":0},{"$f":"IFERROR(VLOOKUP($A354,Filtro!$A$5:$K$272,5,FALSE),0)","v":0}]
["80308033","0308033","Células anaranjadas (proc. aut.)",0,{"$f":"IFERROR(VLOOKUP($A355,Filtro!$A$5:$K$272,3,FALSE),0)","v":0},{"$f":"IFERROR(VLOOKUP($A355,Filtro!$A$5:$K$272,4,FALSE),0)","v":0},{"$f":"IFERROR(VLOOKUP($A355,Filtro!$A$5:$K$272,5,FALSE),0)","v":0}]
["80308034","0308034","Contaminantes (meconio y sangre) (proc. aut.)",0,{"$f":"IFERROR(VLOOKUP($A356,Filtro!$A$5:$K$272,3,FALSE),0)","v":0},{"$f":"IFERROR(VLOOKUP($A356,Filtro!$A$5:$K$272,4,FALSE),0)","v":0},{"$f":"IFERROR(VLOOKUP($A356,Filtro!$A$5:$K$272,5,FALSE),0)","v":0}]
["80308035","0308035","Creatinina (proc. aut.)",0,{"$f":"IFERROR(VLOOKUP($A357,Filtro!$A$5:$K$272,3,FALSE),0)","v":0},{"$f":"IFERROR(VLOOKUP($A357,Filtro!$A$5:$K$272,4,FALSE),0)","v":0},{"$f":"IFERROR(VLOOKUP($A357,Filtro!$A$5:$K$272,5,FALSE),0)","v":0}]
["80308036","0308036","Fosfatidil glicerol y/o fosfatidil inositol",0,{"$f":"IFERROR(VLOOKUP($A358,Filtro!$A$5:$K$272,3,FALSE),0)","v":0},{"$f":"IFERROR(VLOOKUP($A358,Filtro!$A$5:$K$272,4,FALSE),0)","v":0},{"$f":"IFERROR(VLOOKUP($A358,Filtro!$A$5:$K$272,5,FALSE),0)","v":0}]
["80308037","0308037","Indice de bilirrubina (prueba de Liley)",0,{"$f":"IFERROR(VLOOKUP($A359,Filtro!$A$5:$K$272,3,FALSE),0)","v":0},{"$f":"IFERROR(VLOOKUP($A359,Filtro!$A$5:$K$272,4,FALSE),0)","v":0},{"$f":"IFERROR(VLOOKUP($A359,Filtro!$A$5:$K$272,5,FALSE),0)","v":0}]
["80308038","0308038","Indice lecitina/esfingomielina",0,{"$f":"IFERROR(VLOOKUP($A360,Filtro!$A$5:$K$272,3,FALSE),0)","v":0},{"$f":"IFERROR(VLOOKUP($A360,Filtro!$A$5:$K$272,4,FALSE),0)","v":0},{"$f":"IFERROR(VLOOKUP($A360,Filtro!$A$5:$K$272,5,FALSE),0)","v":0}]
["80308039","0308039","Madurez fetal completa (físico; células anaranjadas, bilirrubina, test de Clements, creatinina, contaminantes)",0,{"$f":"IFERROR(VLOOKUP($A361,Filtro!$A$5:$K$272,3,FALSE),0)","v":0},{"$f":"IFERROR(VLOOKUP($A361,Filtro!$A$5:$K$272,4,FALSE),0)","v":0},{"$f":"IFERROR(VLOOKUP($A361,Filtro!$A$5:$K$272,5,FALSE),0)","v":0}]
["80308040","0308040","Test de Clements (proc. aut.)",0,{"$f":"IFERROR(VLOOKUP($A362,Filtro!$A$5:$K$272,3,FALSE),0)","v":0},{"$f":"IFERROR(VLOOKUP($A362,Filtro!$A$5:$K$272,4,FALSE),0)","v":0},{"$f":"IFERROR(VLOOKUP($A362,Filtro!$A$5:$K$272,5,FALSE),0)","v":0}]
["80308041","0308041","Colpocitograma",0,{"$f":"IFERROR(VLOOKUP($A363,Filtro!$A$5:$K$272,3,FALSE),0)","v":0},{"$f":"IFERROR(VLOOKUP($A363,Filtro!$A$5:$K$272,4,FALSE),0)","v":0},{"$f":"IFERROR(VLOOKUP($A363,Filtro!$A$5:$K$272,5,FALSE),0)","v":0}]
["80308042","0308042","Cristalización y filancia de moco cervical",0,{"$f":"IFERROR(VLOOKUP($A364,Filtro!$A$5:$K$272,3,FALSE),0)","v":0},{"$f":"IFERROR(VLOOKUP($A364,Filtro!$A$5:$K$272,4,FALSE),0)","v":0},{"$f":"IFERROR(VLOOKUP($A364,Filtro!$A$5:$K$272,5,FALSE),0)","v":0}]
["80308043","0308043","Moco-semen, prueba de compatibilidad",0,{"$f":"IFERROR(VLOOKUP($A365,Filtro!$A$5:$K$272,3,FALSE),0)","v":0},{"$f":"IFERROR(VLOOKUP($A365,Filtro!$A$5:$K$272,4,FALSE),0)","v":0},{"$f":"IFERROR(VLOOKUP($A365,Filtro!$A$5:$K$272,5,FALSE),0)","v":0}]
["80308044","0308044","Flujo vaginal o secreción uretral, estudio de (incluye toma de muestra y códigos 03-06-004, 03-06-005, 03-06-008, 03-06-017, y 03-06-026 )",69,{"$f":"IFERROR(VLOOKUP($A366,Filtro!$A$5:$K$272,3,FALSE),0)","v":0},{"$f":"IFERROR(VLOOKUP($A366,Filtro!$A$5:$K$272,4,FALSE),0)","v":69},{"$f":"IFERROR(VLOOKUP($A366,Filtro!$A$5:$K$272,5,FALSE),0)","v":22}]
[null,"TOTAL",null,{"$f":"SUM(D323:D366)","v":615},{"$f":"SUM(E323:E366)","v":0},{"$f":"SUM(F323:F366)","v":615},{"$f":"SUM(G323:G366)","v":291}]
[]
[null,"EXÁMENES DE ORINA"]
["80309001","0309001","Acido ascórbico",{"$f":"SUM(E370:F370)","v":0},{"$f":"IFERROR(VLOOKUP($A370,Filtro!$A$5:$K$272,3,FALSE),0)","v":0},{"$f":"IFERROR(VLOOKUP($A370,Filtro!$A$5:$K$272,4,FALSE),0)","v":0},{"$f":"IFERROR(VLOOKUP($A370,Filtro!$A$5:$K$272,5,FALSE),0)","v":0}]
["80309002","0309002","Acido delta aminolevulínico",0,{"$f":"IFERROR(VLOOKUP($A371,Filtro!$A$5:$K$272,3,FALSE),0)","v":0},{"$f":"IFERROR(VLOOKUP($A371,Filtro!$A$5:$K$272,4,FALSE),0)","v":0},{"$f":"IFERROR(VLOOKUP($A371,Filtro!$A$5:$K$272,5,FALSE),0)","v":0}]
["80309003","0309003","Acido fenilpirúvico (PKU, cualitativo)",0,{"$f":"IFERROR(VLOOKUP($A372,Filtro!$A$5:$K$272,3,FALSE),0)","v":0},{"$f":"IFERROR(VLOOKUP($A372,Filtro!$A$5:$K$272,4,FALSE),0)","v":0},{"$f":"IFERROR(VLOOKUP($A372,Filtro!$A$5:$K$272,5,FALSE),0)","v":0}]
["80309004","0309004","Acido úrico cuantitativo",0,{"$f":"IFERROR(VLOOKUP($A373,Filtro!$A$5:$K$272,3,FALSE),0)","v":0},{"$f":"IFERROR(VLOOKUP($A373,Filtro!$A$5:$K$272,4,FALSE),0)","v":0},{"$f":"IFERROR(VLOOKUP($A373,Filtro!$A$5:$K$272,5,FALSE),0)","v":185}]
["80309005","0309005","Acido 5 hidroxiindolacético cuantitativo",0,{"$f":"IFERROR(VLOOKUP($A374,Filtro!$A$5:$K$272,3,FALSE),0)","v":0},{"$f":"IFERROR(VLOOKUP($A374,Filtro!$A$5:$K$272,4,FALSE),0)","v":0},{"$f":"IFERROR(VLOOKUP($A374,Filtro!$A$5:$K$272,5,FALSE),0)","v":0}]
["80309006","0309006","Amilasa cuantitativa en orina",0,{"$f":"IFERROR(VLOOKUP($A375,Filtro!$A$5:$K$272,3,FALSE),0)","v":0},{"$f":"IFERROR(VLOOKUP($A375,Filtro!$A$5:$K$272,4,FALSE),0)","v":0},{"$f":"IFERROR(VLOOKUP($A375,Filtro!$A$5:$K$272,5,FALSE),0)","v":0}]
["80309007","0309007","Aminoácidos (cualitativo) (excepto fenilalanina, PKU)",0,{"$f":"IFERROR(VLOOKUP($A376,Filtro!$A$5:$K$272,3,FALSE),0)","v":0},{"$f":"IFERROR(VLOOKUP($A376,Filtro!$A$5:$K$272,4,FALSE),0)","v":0},{"$f":"IFERROR(VLOOKUP($A376,Filtro!$A$5:$K$272,5,FALSE),0)","v":0}]
["80309008","0309008","Calcio cuantitativo en orina",0,{"$f":"IFERROR(VLOOKUP($A377,Filtro!$A$5:$K$272,3,FALSE),0)","v":0},{"$f":"IFERROR(VLOOKUP($A377,Filtro!$A$5:$K$272,4,FALSE),0)","v":0},{"$f":"IFERROR(VLOOKUP($A377,Filtro!$A$5:$K$272,5,FALSE),0)","v":2}]
["80309009","0309009","Cálculo urinario (examen físico y químico)",0,{"$f":"IFERROR(VLOOKUP($A378,Filtro!$A$5:$K$272,3,FALSE),0)","v":0},{"$f":"IFERROR(VLOOKUP($A378,Filtro!$A$5:$K$272,4,FALSE),0)","v":0},{"$f":"IFERROR(VLOOKUP($A378,Filtro!$A$5:$K$272,5,FALSE),0)","v":0}]
["80309010","0309010","Creatinina cuantitativa en orina",{"v":5916,"d":"5,916"},{"$f":"IFERROR(VLOOKUP($A379,Filtro!$A$5:$K$272,3,FALSE),0)","v":0},{"$f":"IFERROR(VLOOKUP($A379,Filtro!$A$5:$K$272,4,FALSE),0)","v":{"v":5916,"d":"5,916"}},{"$f":"IFERROR(VLOOKUP($A379,Filtro!$A$5:$K$272,5,FALSE),0)","v":{"v":6371,"d":"6,371"}}]
["80309011","0309011","Cuerpos cetónicos",0,{"$f":"IFERROR(VLOOKUP($A380,Filtro!$A$5:$K$272,3,FALSE),0)","v":0},{"$f":"IFERROR(VLOOKUP($A380,Filtro!$A$5:$K$272,4,FALSE),0)","v":0},{"$f":"IFERROR(VLOOKUP($A380,Filtro!$A$5:$K$272,5,FALSE),0)","v":0}]
["80309012","0309012","Electrolitos (sodio, potasio, cloro) c/u en orina",0,{"$f":"IFERROR(VLOOKUP($A381,Filtro!$A$5:$K$272,3,FALSE),0)","v":0},{"$f":"IFERROR(VLOOKUP($A381,Filtro!$A$5:$K$272,4,FALSE),0)","v":0},{"$f":"IFERROR(VLOOKUP($A381,Filtro!$A$5:$K$272,5,FALSE),0)","v":47}]
["80309013","0309013","Microalbuminuria cuantitativa",{"v":6019,"d":"6,019"},{"$f":"IFERROR(VLOOKUP($A382,Filtro!$A$5:$K$272,3,FALSE),0)","v":0},{"$f":"IFERROR(VLOOKUP($A382,Filtro!$A$5:$K$272,4,FALSE),0)","v":{"v":6019,"d":"6,019"}},{"$f":"IFERROR(VLOOKUP($A382,Filtro!$A$5:$K$272,5,FALSE),0)","v":{"v":7612,"d":"7,612"}}]
["80309014","0309014","Embarazo, detección de (cualquier técnica)",64,{"$f":"IFERROR(VLOOKUP($A383,Filtro!$A$5:$K$272,3,FALSE),0)","v":34},{"$f":"IFERROR(VLOOKUP($A383,Filtro!$A$5:$K$272,4,FALSE),0)","v":30},{"$f":"IFERROR(VLOOKUP($A383,Filtro!$A$5:$K$272,5,FALSE),0)","v":21}]
["80309040","0309040","Fenilquetonuria (PKU), cuantitativo",0,{"$f":"IFERROR(VLOOKUP($A384,Filtro!$A$5:$K$272,3,FALSE),0)","v":0},{"$f":"IFERROR(VLOOKUP($A384,Filtro!$A$5:$K$272,4,FALSE),0)","v":0},{"$f":"IFERROR(VLOOKUP($A384,Filtro!$A$5:$K$272,5,FALSE),0)","v":0}]
["80309015","0309015","Fósforo cuantitativo en orina",0,{"$f":"IFERROR(VLOOKUP($A385,Filtro!$A$5:$K$272,3,FALSE),0)","v":0},{"$f":"IFERROR(VLOOKUP($A385,Filtro!$A$5:$K$272,4,FALSE),0)","v":0},{"$f":"IFERROR(VLOOKUP($A385,Filtro!$A$5:$K$272,5,FALSE),0)","v":2}]
["80309016","0309016","Glucosa (cuantitativo) en orina",191,{"$f":"IFERROR(VLOOKUP($A386,Filtro!$A$5:$K$272,3,FALSE),0)","v":0},{"$f":"IFERROR(VLOOKUP($A386,Filtro!$A$5:$K$272,4,FALSE),0)","v":191},{"$f":"IFERROR(VLOOKUP($A386,Filtro!$A$5:$K$272,5,FALSE),0)","v":0}]
["80309035","0309035","Hemosiderina",0,{"$f":"IFERROR(VLOOKUP($A387,Filtro!$A$5:$K$272,3,FALSE),0)","v":0},{"$f":"IFERROR(VLOOKUP($A387,Filtro!$A$5:$K$272,4,FALSE),0)","v":0},{"$f":"IFERROR(VLOOKUP($A387,Filtro!$A$5:$K$272,5,FALSE),0)","v":0}]
["80309017","0309017","Hidroxiprolina en orina",0,{"$f":"IFERROR(VLOOKUP($A388,Filtro!$A$5:$K$272,3,FALSE),0)","v":0},{"$f":"IFERROR(VLOOKUP($A388,Filtro!$A$5:$K$272,4,FALSE),0)","v":0},{"$f":"IFERROR(VLOOKUP($A388,Filtro!$A$5:$K$272,5,FALSE),0)","v":0}]
["80309018","0309018","Melanogenuria (test de cloruro férrico)",0,{"$f":"IFERROR(VLOOKUP($A389,Filtro!$A$5:$K$272,3,FALSE),0)","v":0},{"$f":"IFERROR(VLOOKUP($A389,Filtro!$A$5:$K$272,4,FALSE),0)","v":0},{"$f":"IFERROR(VLOOKUP($A389,Filtro!$A$5:$K$272,5,FALSE),0)","v":0}]
["80309019","0309019","Mucopolisacáridos",0,{"$f":"IFERROR(VLOOKUP($A390,Filtro!$A$5:$K$272,3,FALSE),0)","v":0},{"$f":"IFERROR(VLOOKUP($A390,Filtro!$A$5:$K$272,4,FALSE),0)","v":0},{"$f":"IFERROR(VLOOKUP($A390,Filtro!$A$5:$K$272,5,FALSE),0)","v":0}]
["80309020","0309020","Nitrógeno ureico o urea en orina (cuantitativo)",0,{"$f":"IFERROR(VLOOKUP($A391,Filtro!$A$5:$K$272,3,FALSE),0)","v":0},{"$f":"IFERROR(VLOOKUP($A391,Filtro!$A$5:$K$272,4,FALSE),0)","v":0},{"$f":"IFERROR(VLOOKUP($A391,Filtro!$A$5:$K$272,5,FALSE),0)","v":0}]
["80309021","0309021","Nucleótidos cíclicos (CAMP, CGM, u otros) c/u",0,{"$f":"IFERROR(VLOOKUP($A392,Filtro!$A$5:$K$272,3,FALSE),0)","v":0},{"$f":"IFERROR(VLOOKUP($A392,Filtro!$A$5:$K$272,4,FALSE),0)","v":0},{"$f":"IFERROR(VLOOKUP($A392,Filtro!$A$5:$K$272,5,FALSE),0)","v":0}]
["80309022","0309022","Orina completa, (incluye cód. 03-09-023 y 03-09-024)",{"v":8777,"d":"8,777"},{"$f":"IFERROR(VLOOKUP($A393,Filtro!$A$5:$K$272,3,FALSE),0)","v":48},{"$f":"IFERROR(VLOOKUP($A393,Filtro!$A$5:$K$272,4,FALSE),0)","v":{"v":8729,"d":"8,729"}},{"$f":"IFERROR(VLOOKUP($A393,Filtro!$A$5:$K$272,5,FALSE),0)","v":{"v":15625,"d":"15,625"}}]
["80309023","0309023","Orina, físico-químico (aspecto, color, densidad, pH, proteínas, glucosa, cuerpos cetónicos, urobilinógeno, bilirrubina, hemoglobina y nitritos) todos o cada uno de los parámetros (proc. aut.)",52,{"$f":"IFERROR(VLOOKUP($A394,Filtro!$A$5:$K$272,3,FALSE),0)","v":50},{"$f":"IFERROR(VLOOKUP($A394,Filtro!$A$5:$K$272,4,FALSE),0)","v":2},{"$f":"IFERROR(VLOOKUP($A394,Filtro!$A$5:$K$272,5,FALSE),0)","v":{"v":1084,"d":"1,084"}}]
["80309024","0309024","Orina, sedimento (proc. aut.)",135,{"$f":"IFERROR(VLOOKUP($A395,Filtro!$A$5:$K$272,3,FALSE),0)","v":135},{"$f":"IFERROR(VLOOKUP($A395,Filtro!$A$5:$K$272,4,FALSE),0)","v":0},{"$f":"IFERROR(VLOOKUP($A395,Filtro!$A$5:$K$272,5,FALSE),0)","v":839}]
["80309025","0309025","Osmolalidad",0,{"$f":"IFERROR(VLOOKUP($A396,Filtro!$A$5:$K$272,3,FALSE),0)","v":0},{"$f":"IFERROR(VLOOKUP($A396,Filtro!$A$5:$K$272,4,FALSE),0)","v":0},{"$f":"IFERROR(VLOOKUP($A396,Filtro!$A$5:$K$272,5,FALSE),0)","v":0}]
["80309027","0309027","Porfirinas, c/u",0,{"$f":"IFERROR(VLOOKUP($A397,Filtro!$A$5:$K$272,3,FALSE),0)","v":0},{"$f":"IFERROR(VLOOKUP($A397,Filtro!$A$5:$K$272,4,FALSE),0)","v":0},{"$f":"IFERROR(VLOOKUP($A397,Filtro!$A$5:$K$272,5,FALSE),0)","v":0}]
["80309028","0309028","Proteína (cuantitativa) en orina",125,{"$f":"IFERROR(VLOOKUP($A398,Filtro!$A$5:$K$272,3,FALSE),0)","v":0},{"$f":"IFERROR(VLOOKUP($A398,Filtro!$A$5:$K$272,4,FALSE),0)","v":125},{"$f":"IFERROR(VLOOKUP($A398,Filtro!$A$5:$K$272,5,FALSE),0)","v":{"v":1942,"d":"1,942"}}]
["80309029","0309029","Proteínas de Bence-Jones prueba térmica",0,{"$f":"IFERROR(VLOOKUP($A399,Filtro!$A$5:$K$272,3,FALSE),0)","v":0},{"$f":"IFERROR(VLOOKUP($A399,Filtro!$A$5:$K$272,4,FALSE),0)","v":0},{"$f":"IFERROR(VLOOKUP($A399,Filtro!$A$5:$K$272,5,FALSE),0)","v":0}]
[null,"TOTAL",null,{"$f":"SUM(D370:D399)","v":{"v":21279,"d":"21,279"}},{"$f":"SUM(E370:E399)","v":267},{"$f":"SUM(F370:F399)","v":{"v":21012,"d":"21,012"}},{"$f":"SUM(G370:G399)","v":{"v":33730,"d":"33,730"}}]
[null,"TOTAL EXÁMENES",null,{"$f":"+D98+D170+D179+D239+D320+D367+D400","v":{"v":117482,"d":"117,482"}},{"$f":"+E98+E170+E179+E239+E320+E367+E400","v":714},{"$f":"+F98+F170+F179+F239+F320+F367+F400","v":{"v":116768,"d":"116,768"}},{"$f":"+G98+G170+G179+G239+G320+G367+G400","v":{"v":231696,"d":"231,696"}}]
[]
[null,"EXÁMENES RADIOLÓGICOS"]
["80401001","0401001","Radiografía de las glándulas salivales \"sialografía\"",{"$f":"SUM(E404:F404)","v":3},{"$f":"IFERROR(VLOOKUP($A404,Filtro!$A$5:$K$272,3,FALSE),0)","v":3},{"$f":"IFERROR(VLOOKUP($A404,Filtro!$A$5:$K$272,4,FALSE),0)","v":0},{"$f":"IFERROR(VLOOKUP($A404,Filtro!$A$5:$K$272,5,FALSE),0)","v":0}]
["80401002","0401002","Radiografía de partes blandas, laringe lateral, cavum rinofaríngeo (rinofarinx). ",{"$f":"SUM(E405:F405)","v":42},{"$f":"IFERROR(VLOOKUP($A405,Filtro!$A$5:$K$272,3,FALSE),0)","v":42},{"$f":"IFERROR(VLOOKUP($A405,Filtro!$A$5:$K$272,4,FALSE),0)","v":0},{"$f":"IFERROR(VLOOKUP($A405,Filtro!$A$5:$K$272,5,FALSE),0)","v":41}]
["80401003","0401003","Planigrafías laringe  (4 EXP.)                     ",0,{"$f":"IFERROR(VLOOKUP($A406,Filtro!$A$5:$K$272,3,FALSE),0)","v":0},{"$f":"IFERROR(VLOOKUP($A406,Filtro!$A$5:$K$272,4,FALSE),0)","v":0},{"$f":"IFERROR(VLOOKUP($A406,Filtro!$A$5:$K$272,5,FALSE),0)","v":0}]
["80401004","0401004","Radiografía de tórax, proyección complementaria (oblicuas, selectivas u otras)",0,{"$f":"IFERROR(VLOOKUP($A407,Filtro!$A$5:$K$272,3,FALSE),0)","v":0},{"$f":"IFERROR(VLOOKUP($A407,Filtro!$A$5:$K$272,4,FALSE),0)","v":0},{"$f":"IFERROR(VLOOKUP($A407,Filtro!$A$5:$K$272,5,FALSE),0)","v":0}]
["80401005","0401005","Tórax, proyección complementaria de corazón (oblicuas u otras) (1 exp.) c/u       ",0,{"$f":"IFERROR(VLOOKUP($A408,Filtro!$A$5:$K$272,3,FALSE),0)","v":0},{"$f":"IFERROR(VLOOKUP($A408,Filtro!$A$5:$K$272,4,FALSE),0)","v":0},{"$f":"IFERROR(VLOOKUP($A408,Filtro!$A$5:$K$272,5,FALSE),0)","v":0}]
["80401006","0401006","Estudio radiológico de corazón (incluye fluoroscopía, telerradiografías frontal y lateral con esofagograma) ",0,{"$f":"IFERROR(VLOOKUP($A409,Filtro!$A$5:$K$272,3,FALSE),0)","v":0},{"$f":"IFERROR(VLOOKUP($A409,Filtro!$A$5:$K$272,4,FALSE),0)","v":0},{"$f":"IFERROR(VLOOKUP($A409,Filtro!$A$5:$K$272,5,FALSE),0)","v":0}]
["80401007","0401007","Planigrafia localizada (incluye mínimo 6 cortes) (6 exp.)     ",0,{"$f":"IFERROR(VLOOKUP($A410,Filtro!$A$5:$K$272,3,FALSE),0)","v":0},{"$f":"IFERROR(VLOOKUP($A410,Filtro!$A$5:$K$272,4,FALSE),0)","v":0},{"$f":"IFERROR(VLOOKUP($A410,Filtro!$A$5:$K$272,5,FALSE),0)","v":0}]
["80401008","0401008","Radiografía de tórax  frontal o lateral con equipo móvil fuera del departamento de rayos.",0,{"$f":"IFERROR(VLOOKUP($A411,Filtro!$A$5:$K$272,3,FALSE),0)","v":0},{"$f":"IFERROR(VLOOKUP($A411,Filtro!$A$5:$K$272,4,FALSE),0)","v":0},{"$f":"IFERROR(VLOOKUP($A411,Filtro!$A$5:$K$272,5,FALSE),0)","v":0}]
["80401009","0401009","Radiografía de tórax simple frontal o lateral ",140,{"$f":"IFERROR(VLOOKUP($A412,Filtro!$A$5:$K$272,3,FALSE),0)","v":130},{"$f":"IFERROR(VLOOKUP($A412,Filtro!$A$5:$K$272,4,FALSE),0)","v":10},{"$f":"IFERROR(VLOOKUP($A412,Filtro!$A$5:$K$272,5,FALSE),0)","v":53}]
["80401070","0401070","Radiografía de tórax frontal y lateral",{"v":1617,"d":"1,617"},{"$f":"IFERROR(VLOOKUP($A413,Filtro!$A$5:$K$272,3,FALSE),0)","v":{"v":1373,"d":"1,373"}},{"$f":"IFERROR(VLOOKUP($A413,Filtro!$A$5:$K$272,4,FALSE),0)","v":244},{"$f":"IFERROR(VLOOKUP($A413,Filtro!$A$5:$K$272,5,FALSE),0)","v":905}]
["80401010","0401010","Mamografía bilateral",282,{"$f":"IFERROR(VLOOKUP($A414,Filtro!$A$5:$K$272,3,FALSE),0)","v":0},{"$f":"IFERROR(VLOOKUP($A414,Filtro!$A$5:$K$272,4,FALSE),0)","v":282},{"$f":"IFERROR(VLOOKUP($A414,Filtro!$A$5:$K$272,5,FALSE),0)","v":350}]
["80401110","0401110","Mamografía unilateral",0,{"$f":"IFERROR(VLOOKUP($A415,Filtro!$A$5:$K$272,3,FALSE),0)","v":0},{"$f":"IFERROR(VLOOKUP($A415,Filtro!$A$5:$K$272,4,FALSE),0)","v":0},{"$f":"IFERROR(VLOOKUP($A415,Filtro!$A$5:$K$272,5,FALSE),0)","v":0}]
["80401130","0401130","Mamografía proyección complementaria  (axilar u otras)",0,{"$f":"IFERROR(VLOOKUP($A416,Filtro!$A$5:$K$272,3,FALSE),0)","v":0},{"$f":"IFERROR(VLOOKUP($A416,Filtro!$A$5:$K$272,4,FALSE),0)","v":0},{"$f":"IFERROR(VLOOKUP($A416,Filtro!$A$5:$K$272,5,FALSE),0)","v":0}]
["80401011","0401011","Marcación preoperatoria de lesiones de la mama",0,{"$f":"IFERROR(VLOOKUP($A417,Filtro!$A$5:$K$272,3,FALSE),0)","v":0},{"$f":"IFERROR(VLOOKUP($A417,Filtro!$A$5:$K$272,4,FALSE),0)","v":0},{"$f":"IFERROR(VLOOKUP($A417,Filtro!$A$5:$K$272,5,FALSE),0)","v":0}]
["80401012","0401012","Radiografía de mama, pieza operatoria",0,{"$f":"IFERROR(VLOOKUP($A418,Filtro!$A$5:$K$272,3,FALSE),0)","v":0},{"$f":"IFERROR(VLOOKUP($A418,Filtro!$A$5:$K$272,4,FALSE),0)","v":0},{"$f":"IFERROR(VLOOKUP($A418,Filtro!$A$5:$K$272,5,FALSE),0)","v":0}]
["80401013","0401013","Radiografía de Abdomen Simple",244,{"$f":"IFERROR(VLOOKUP($A419,Filtro!$A$5:$K$272,3,FALSE),0)","v":244},{"$f":"IFERROR(VLOOKUP($A419,Filtro!$A$5:$K$272,4,FALSE),0)","v":0},{"$f":"IFERROR(VLOOKUP($A419,Filtro!$A$5:$K$272,5,FALSE),0)","v":65}]
["80401014","0401014","Radiografía de abdomen simple, proyección complementaria (lateral y/o oblicua)",17,{"$f":"IFERROR(VLOOKUP($A420,Filtro!$A$5:$K$272,3,FALSE),0)","v":17},{"$f":"IFERROR(VLOOKUP($A420,Filtro!$A$5:$K$272,4,FALSE),0)","v":0},{"$f":"IFERROR(VLOOKUP($A420,Filtro!$A$5:$K$272,5,FALSE),0)","v":1}]
["80401015","0401015","Colangiografía intra o postoperatoria (por sonda T, o similar)",0,{"$f":"IFERROR(VLOOKUP($A421,Filtro!$A$5:$K$272,3,FALSE),0)","v":0},{"$f":"IFERROR(VLOOKUP($A421,Filtro!$A$5:$K$272,4,FALSE),0)","v":0},{"$f":"IFERROR(VLOOKUP($A421,Filtro!$A$5:$K$272,5,FALSE),0)","v":0}]
["80401016","0401016","Colangiografía medica con planigrafía (6 exp.)        ",0,{"$f":"IFERROR(VLOOKUP($A422,Filtro!$A$5:$K$272,3,FALSE),0)","v":0},{"$f":"IFERROR(VLOOKUP($A422,Filtro!$A$5:$K$272,4,FALSE),0)","v":0},{"$f":"IFERROR(VLOOKUP($A422,Filtro!$A$5:$K$272,5,FALSE),0)","v":0}]
["80401017","0401017","Colecistografía c/s seriografía (34 exp.)                ",0,{"$f":"IFERROR(VLOOKUP($A423,Filtro!$A$5:$K$272,3,FALSE),0)","v":0},{"$f":"IFERROR(VLOOKUP($A423,Filtro!$A$5:$K$272,4,FALSE),0)","v":0},{"$f":"IFERROR(VLOOKUP($A423,Filtro!$A$5:$K$272,5,FALSE),0)","v":0}]
["80401018","0401018","Enema baritado del colon (incluye llene y control post-vaciamiento)",0,{"$f":"IFERROR(VLOOKUP($A424,Filtro!$A$5:$K$272,3,FALSE),0)","v":0},{"$f":"IFERROR(VLOOKUP($A424,Filtro!$A$5:$K$272,4,FALSE),0)","v":0},{"$f":"IFERROR(VLOOKUP($A424,Filtro!$A$5:$K$272,5,FALSE),0)","v":0}]
["80401019","0401019","Enema baritado del colon o intestino delgado, doble contraste",0,{"$f":"IFERROR(VLOOKUP($A425,Filtro!$A$5:$K$272,3,FALSE),0)","v":0},{"$f":"IFERROR(VLOOKUP($A425,Filtro!$A$5:$K$272,4,FALSE),0)","v":0},{"$f":"IFERROR(VLOOKUP($A425,Filtro!$A$5:$K$272,5,FALSE),0)","v":0}]
["80401020","0401020","Esofagograma  (incluye pesquisa de cuerpo extraño) (proc.aut.)",0,{"$f":"IFERROR(VLOOKUP($A426,Filtro!$A$5:$K$272,3,FALSE),0)","v":0},{"$f":"IFERROR(VLOOKUP($A426,Filtro!$A$5:$K$272,4,FALSE),0)","v":0},{"$f":"IFERROR(VLOOKUP($A426,Filtro!$A$5:$K$272,5,FALSE),0)","v":0}]
["80401021","0401021","Radiografía de esófago, estómago y duodeno, relleno y/o doble contraste ",0,{"$f":"IFERROR(VLOOKUP($A427,Filtro!$A$5:$K$272,3,FALSE),0)","v":0},{"$f":"IFERROR(VLOOKUP($A427,Filtro!$A$5:$K$272,4,FALSE),0)","v":0},{"$f":"IFERROR(VLOOKUP($A427,Filtro!$A$5:$K$272,5,FALSE),0)","v":0}]
["80401022","0401022","Estudio radiológico de deglución faríngea",0,{"$f":"IFERROR(VLOOKUP($A428,Filtro!$A$5:$K$272,3,FALSE),0)","v":0},{"$f":"IFERROR(VLOOKUP($A428,Filtro!$A$5:$K$272,4,FALSE),0)","v":0},{"$f":"IFERROR(VLOOKUP($A428,Filtro!$A$5:$K$272,5,FALSE),0)","v":0}]
["80401023","0401023","Estudio radiológico del intestino delgado",0,{"$f":"IFERROR(VLOOKUP($A429,Filtro!$A$5:$K$272,3,FALSE),0)","v":0},{"$f":"IFERROR(VLOOKUP($A429,Filtro!$A$5:$K$272,4,FALSE),0)","v":0},{"$f":"IFERROR(VLOOKUP($A429,Filtro!$A$5:$K$272,5,FALSE),0)","v":0}]
["80401024","0401024","Radiografía de esófago, estómago y duodeno, simple en niños ",0,{"$f":"IFERROR(VLOOKUP($A430,Filtro!$A$5:$K$272,3,FALSE),0)","v":0},{"$f":"IFERROR(VLOOKUP($A430,Filtro!$A$5:$K$272,4,FALSE),0)","v":0},{"$f":"IFERROR(VLOOKUP($A430,Filtro!$A$5:$K$272,5,FALSE),0)","v":0}]
["80401026","0401026","Pielografía de eliminación con control minutado (10 exp.)",0,{"$f":"IFERROR(VLOOKUP($A431,Filtro!$A$5:$K$272,3,FALSE),0)","v":0},{"$f":"IFERROR(VLOOKUP($A431,Filtro!$A$5:$K$272,4,FALSE),0)","v":0},{"$f":"IFERROR(VLOOKUP($A431,Filtro!$A$5:$K$272,5,FALSE),0)","v":0}]
["80401027","0401027","Pielografía de eliminación o descendente: incluye renal y vesical simples previas, 3 placas post inyección de medio de contraste, controles de pie y cistografía pre y post miccional. ",0,{"$f":"IFERROR(VLOOKUP($A432,Filtro!$A$5:$K$272,3,FALSE),0)","v":0},{"$f":"IFERROR(VLOOKUP($A432,Filtro!$A$5:$K$272,4,FALSE),0)","v":0},{"$f":"IFERROR(VLOOKUP($A432,Filtro!$A$5:$K$272,5,FALSE),0)","v":0}]
["80401028","0401028","Radiografía renal simple (proc. aut.)",8,{"$f":"IFERROR(VLOOKUP($A433,Filtro!$A$5:$K$272,3,FALSE),0)","v":8},{"$f":"IFERROR(VLOOKUP($A433,Filtro!$A$5:$K$272,4,FALSE),0)","v":0},{"$f":"IFERROR(VLOOKUP($A433,Filtro!$A$5:$K$272,5,FALSE),0)","v":0}]
["80401029","0401029","Radiografía vesical simple o perivesical (proc. aut.)",3,{"$f":"IFERROR(VLOOKUP($A434,Filtro!$A$5:$K$272,3,FALSE),0)","v":3},{"$f":"IFERROR(VLOOKUP($A434,Filtro!$A$5:$K$272,4,FALSE),0)","v":0},{"$f":"IFERROR(VLOOKUP($A434,Filtro!$A$5:$K$272,5,FALSE),0)","v":0}]
["80401030","0401030","Radiografía agujeros ópticos, ambos lados",0,{"$f":"IFERROR(VLOOKUP($A435,Filtro!$A$5:$K$272,3,FALSE),0)","v":0},{"$f":"IFERROR(VLOOKUP($A435,Filtro!$A$5:$K$272,4,FALSE),0)","v":0},{"$f":"IFERROR(VLOOKUP($A435,Filtro!$A$5:$K$272,5,FALSE),0)","v":0}]
["80401031","0401031","Radiografía de cavidades perinasales, órbitas, articulaciones temporomandibulares, huesos propios de la nariz, malar, maxilar, arco cigomático y cara",345,{"$f":"IFERROR(VLOOKUP($A436,Filtro!$A$5:$K$272,3,FALSE),0)","v":345},{"$f":"IFERROR(VLOOKUP($A436,Filtro!$A$5:$K$272,4,FALSE),0)","v":0},{"$f":"IFERROR(VLOOKUP($A436,Filtro!$A$5:$K$272,5,FALSE),0)","v":105}]
["80401032","0401032","Radiografía de cráneo frontal y lateral",378,{"$f":"IFERROR(VLOOKUP($A437,Filtro!$A$5:$K$272,3,FALSE),0)","v":378},{"$f":"IFERROR(VLOOKUP($A437,Filtro!$A$5:$K$272,4,FALSE),0)","v":0},{"$f":"IFERROR(VLOOKUP($A437,Filtro!$A$5:$K$272,5,FALSE),0)","v":74}]
["80401033","0401033","Radiografía de Cráneo  proyección especial de  base de cráneo (Towne)",22,{"$f":"IFERROR(VLOOKUP($A438,Filtro!$A$5:$K$272,3,FALSE),0)","v":22},{"$f":"IFERROR(VLOOKUP($A438,Filtro!$A$5:$K$272,4,FALSE),0)","v":0},{"$f":"IFERROR(VLOOKUP($A438,Filtro!$A$5:$K$272,5,FALSE),0)","v":3}]
["80401034","0401034","Radiografía de globo ocular, estudio de cuerpo extraño",0,{"$f":"IFERROR(VLOOKUP($A439,Filtro!$A$5:$K$272,3,FALSE),0)","v":0},{"$f":"IFERROR(VLOOKUP($A439,Filtro!$A$5:$K$272,4,FALSE),0)","v":0},{"$f":"IFERROR(VLOOKUP($A439,Filtro!$A$5:$K$272,5,FALSE),0)","v":0}]
["80401035","0401035","Radiografía de oído, uno o ambos ",0,{"$f":"IFERROR(VLOOKUP($A440,Filtro!$A$5:$K$272,3,FALSE),0)","v":0},{"$f":"IFERROR(VLOOKUP($A440,Filtro!$A$5:$K$272,4,FALSE),0)","v":0},{"$f":"IFERROR(VLOOKUP($A440,Filtro!$A$5:$K$272,5,FALSE),0)","v":0}]
["80401036","0401036","Radiografía de oído, uno o ambos (2 proy.) (2 exp.)                     ",0,{"$f":"IFERROR(VLOOKUP($A441,Filtro!$A$5:$K$272,3,FALSE),0)","v":0},{"$f":"IFERROR(VLOOKUP($A441,Filtro!$A$5:$K$272,4,FALSE),0)","v":0},{"$f":"IFERROR(VLOOKUP($A441,Filtro!$A$5:$K$272,5,FALSE),0)","v":0}]
["80401037","0401037","Radiografía de oído, uno o ambos (3 proy.) (3 exp.)                    ",0,{"$f":"IFERROR(VLOOKUP($A442,Filtro!$A$5:$K$272,3,FALSE),0)","v":0},{"$f":"IFERROR(VLOOKUP($A442,Filtro!$A$5:$K$272,4,FALSE),0)","v":0},{"$f":"IFERROR(VLOOKUP($A442,Filtro!$A$5:$K$272,5,FALSE),0)","v":0}]
["80401038","0401038","Planigrafía de oidos (68 exp.)                     ",0,{"$f":"IFERROR(VLOOKUP($A443,Filtro!$A$5:$K$272,3,FALSE),0)","v":0},{"$f":"IFERROR(VLOOKUP($A443,Filtro!$A$5:$K$272,4,FALSE),0)","v":0},{"$f":"IFERROR(VLOOKUP($A443,Filtro!$A$5:$K$272,5,FALSE),0)","v":0}]
["80401039","0401039","Planigrafía silla turca, canal optico, cavidades perinasales, c/u (68 exp.)  ",0,{"$f":"IFERROR(VLOOKUP($A444,Filtro!$A$5:$K$272,3,FALSE),0)","v":0},{"$f":"IFERROR(VLOOKUP($A444,Filtro!$A$5:$K$272,4,FALSE),0)","v":0},{"$f":"IFERROR(VLOOKUP($A444,Filtro!$A$5:$K$272,5,FALSE),0)","v":0}]
["80401040","0401040","Radiografía de silla turca frontal y lateral ",0,{"$f":"IFERROR(VLOOKUP($A445,Filtro!$A$5:$K$272,3,FALSE),0)","v":0},{"$f":"IFERROR(VLOOKUP($A445,Filtro!$A$5:$K$272,4,FALSE),0)","v":0},{"$f":"IFERROR(VLOOKUP($A445,Filtro!$A$5:$K$272,5,FALSE),0)","v":0}]
["80401041","0401041","Planigrafía localizada (cervical, dorsal o lumbosacra) (68 exp.)              ",0,{"$f":"IFERROR(VLOOKUP($A446,Filtro!$A$5:$K$272,3,FALSE),0)","v":0},{"$f":"IFERROR(VLOOKUP($A446,Filtro!$A$5:$K$272,4,FALSE),0)","v":0},{"$f":"IFERROR(VLOOKUP($A446,Filtro!$A$5:$K$272,5,FALSE),0)","v":0}]
["80401042","0401042","Radiografía de columna cervical o atlas-axis (frontal y lateral)",205,{"$f":"IFERROR(VLOOKUP($A447,Filtro!$A$5:$K$272,3,FALSE),0)","v":205},{"$f":"IFERROR(VLOOKUP($A447,Filtro!$A$5:$K$272,4,FALSE),0)","v":0},{"$f":"IFERROR(VLOOKUP($A447,Filtro!$A$5:$K$272,5,FALSE),0)","v":73}]
["80401043","0401043","Radiografía de columna cervical (frontal, lateral y oblicuas)",2,{"$f":"IFERROR(VLOOKUP($A448,Filtro!$A$5:$K$272,3,FALSE),0)","v":2},{"$f":"IFERROR(VLOOKUP($A448,Filtro!$A$5:$K$272,4,FALSE),0)","v":0},{"$f":"IFERROR(VLOOKUP($A448,Filtro!$A$5:$K$272,5,FALSE),0)","v":1}]
["80401044","0401044","Radiografía de columna cervical  flexión y  extensión (Dinámicas)",0,{"$f":"IFERROR(VLOOKUP($A449,Filtro!$A$5:$K$272,3,FALSE),0)","v":0},{"$f":"IFERROR(VLOOKUP($A449,Filtro!$A$5:$K$272,4,FALSE),0)","v":0},{"$f":"IFERROR(VLOOKUP($A449,Filtro!$A$5:$K$272,5,FALSE),0)","v":0}]
["80401045","0401045","Radiografía de columna dorsal o dorsolumbar localizada, parrilla costal adultos (frontal y lateral).",395,{"$f":"IFERROR(VLOOKUP($A450,Filtro!$A$5:$K$272,3,FALSE),0)","v":395},{"$f":"IFERROR(VLOOKUP($A450,Filtro!$A$5:$K$272,4,FALSE),0)","v":0},{"$f":"IFERROR(VLOOKUP($A450,Filtro!$A$5:$K$272,5,FALSE),0)","v":121}]
["80401046","0401046","Radiografía columna lumbar o lumbosacra   ",289,{"$f":"IFERROR(VLOOKUP($A451,Filtro!$A$5:$K$272,3,FALSE),0)","v":289},{"$f":"IFERROR(VLOOKUP($A451,Filtro!$A$5:$K$272,4,FALSE),0)","v":0},{"$f":"IFERROR(VLOOKUP($A451,Filtro!$A$5:$K$272,5,FALSE),0)","v":139}]
["80401047","0401047","Radiografía columna lumbar o lumbosacra  flexión y  extensión (Dinámicas)",0,{"$f":"IFERROR(VLOOKUP($A452,Filtro!$A$5:$K$272,3,FALSE),0)","v":0},{"$f":"IFERROR(VLOOKUP($A452,Filtro!$A$5:$K$272,4,FALSE),0)","v":0},{"$f":"IFERROR(VLOOKUP($A452,Filtro!$A$5:$K$272,5,FALSE),0)","v":0}]
["80401048","0401048","Radiografía columna lumbar o lumbosacra, oblicuas adicionales ",0,{"$f":"IFERROR(VLOOKUP($A453,Filtro!$A$5:$K$272,3,FALSE),0)","v":0},{"$f":"IFERROR(VLOOKUP($A453,Filtro!$A$5:$K$272,4,FALSE),0)","v":0},{"$f":"IFERROR(VLOOKUP($A453,Filtro!$A$5:$K$272,5,FALSE),0)","v":0}]
["80401049","0401049","Radiografía de columna total, panorámica con folio graduado  frontal o lateral",0,{"$f":"IFERROR(VLOOKUP($A454,Filtro!$A$5:$K$272,3,FALSE),0)","v":0},{"$f":"IFERROR(VLOOKUP($A454,Filtro!$A$5:$K$272,4,FALSE),0)","v":0},{"$f":"IFERROR(VLOOKUP($A454,Filtro!$A$5:$K$272,5,FALSE),0)","v":0}]
["80401051","0401051","Radiografía de pelvis, cadera o coxofemoral",446,{"$f":"IFERROR(VLOOKUP($A455,Filtro!$A$5:$K$272,3,FALSE),0)","v":446},{"$f":"IFERROR(VLOOKUP($A455,Filtro!$A$5:$K$272,4,FALSE),0)","v":0},{"$f":"IFERROR(VLOOKUP($A455,Filtro!$A$5:$K$272,5,FALSE),0)","v":201}]
["80401151","0401151","Radiografía de pelvis, cadera o coxofemoral de RN, lactante o niño menor de 6 años.",286,{"$f":"IFERROR(VLOOKUP($A456,Filtro!$A$5:$K$272,3,FALSE),0)","v":135},{"$f":"IFERROR(VLOOKUP($A456,Filtro!$A$5:$K$272,4,FALSE),0)","v":151},{"$f":"IFERROR(VLOOKUP($A456,Filtro!$A$5:$K$272,5,FALSE),0)","v":340}]
["80401052","0401052","Radiografía de pelvis, cadera o coxofemoral, proyecciones especiales; (rotación interna, abducción, lateral, Lawenstein u otras)",147,{"$f":"IFERROR(VLOOKUP($A457,Filtro!$A$5:$K$272,3,FALSE),0)","v":147},{"$f":"IFERROR(VLOOKUP($A457,Filtro!$A$5:$K$272,4,FALSE),0)","v":0},{"$f":"IFERROR(VLOOKUP($A457,Filtro!$A$5:$K$272,5,FALSE),0)","v":120}]
["80401053","0401053","Radiografía de Sacrocoxis o articulaciones sacroilíacas.",67,{"$f":"IFERROR(VLOOKUP($A458,Filtro!$A$5:$K$272,3,FALSE),0)","v":67},{"$f":"IFERROR(VLOOKUP($A458,Filtro!$A$5:$K$272,4,FALSE),0)","v":0},{"$f":"IFERROR(VLOOKUP($A458,Filtro!$A$5:$K$272,5,FALSE),0)","v":12}]
["80401054","0401054","Radiografía de brazo, antebrazo, codo, muñeca, mano, dedos, pie  (frontal y lateral)",{"v":2302,"d":"2,302"},{"$f":"IFERROR(VLOOKUP($A459,Filtro!$A$5:$K$272,3,FALSE),0)","v":{"v":2302,"d":"2,302"}},{"$f":"IFERROR(VLOOKUP($A459,Filtro!$A$5:$K$272,4,FALSE),0)","v":0},{"$f":"IFERROR(VLOOKUP($A459,Filtro!$A$5:$K$272,5,FALSE),0)","v":629}]
["80401055","0401055","Radiografía de clavícula.",46,{"$f":"IFERROR(VLOOKUP($A460,Filtro!$A$5:$K$272,3,FALSE),0)","v":46},{"$f":"IFERROR(VLOOKUP($A460,Filtro!$A$5:$K$272,4,FALSE),0)","v":0},{"$f":"IFERROR(VLOOKUP($A460,Filtro!$A$5:$K$272,5,FALSE),0)","v":11}]
["80401056","0401056","Radiografía Edad Ósea: carpo y mano ",5,{"$f":"IFERROR(VLOOKUP($A461,Filtro!$A$5:$K$272,3,FALSE),0)","v":5},{"$f":"IFERROR(VLOOKUP($A461,Filtro!$A$5:$K$272,4,FALSE),0)","v":0},{"$f":"IFERROR(VLOOKUP($A461,Filtro!$A$5:$K$272,5,FALSE),0)","v":5}]
["80401057","0401057","Radiografía Edad ósea : rodilla frontal",0,{"$f":"IFERROR(VLOOKUP($A462,Filtro!$A$5:$K$272,3,FALSE),0)","v":0},{"$f":"IFERROR(VLOOKUP($A462,Filtro!$A$5:$K$272,4,FALSE),0)","v":0},{"$f":"IFERROR(VLOOKUP($A462,Filtro!$A$5:$K$272,5,FALSE),0)","v":0}]
["80401058","0401058","Estudio radiológico de escafoides",2,{"$f":"IFERROR(VLOOKUP($A463,Filtro!$A$5:$K$272,3,FALSE),0)","v":2},{"$f":"IFERROR(VLOOKUP($A463,Filtro!$A$5:$K$272,4,FALSE),0)","v":0},{"$f":"IFERROR(VLOOKUP($A463,Filtro!$A$5:$K$272,5,FALSE),0)","v":1}]
["80401059","0401059","Estudio radiológico de muñeca o tobillo frontal lateral y oblicuas",305,{"$f":"IFERROR(VLOOKUP($A464,Filtro!$A$5:$K$272,3,FALSE),0)","v":305},{"$f":"IFERROR(VLOOKUP($A464,Filtro!$A$5:$K$272,4,FALSE),0)","v":0},{"$f":"IFERROR(VLOOKUP($A464,Filtro!$A$5:$K$272,5,FALSE),0)","v":63}]
["80401060","0401060","Radiografía de hombro, fémur, rodilla, pierna, costilla o esternón Frontal y Lateral",{"v":1369,"d":"1,369"},{"$f":"IFERROR(VLOOKUP($A465,Filtro!$A$5:$K$272,3,FALSE),0)","v":{"v":1369,"d":"1,369"}},{"$f":"IFERROR(VLOOKUP($A465,Filtro!$A$5:$K$272,4,FALSE),0)","v":0},{"$f":"IFERROR(VLOOKUP($A465,Filtro!$A$5:$K$272,5,FALSE),0)","v":569}]
["80401061","0401061","Planigrafía ósea frontal y/o lateral (6 exp.) ",0,{"$f":"IFERROR(VLOOKUP($A466,Filtro!$A$5:$K$272,3,FALSE),0)","v":0},{"$f":"IFERROR(VLOOKUP($A466,Filtro!$A$5:$K$272,4,FALSE),0)","v":0},{"$f":"IFERROR(VLOOKUP($A466,Filtro!$A$5:$K$272,5,FALSE),0)","v":0}]
["80401062","0401062","Radiografía de Proyecciones especiales oblicuas u otras en hombro, brazo, codo, rodilla, rótulas, sesamoideos, axial de ambas rótulas o similares",83,{"$f":"IFERROR(VLOOKUP($A467,Filtro!$A$5:$K$272,3,FALSE),0)","v":83},{"$f":"IFERROR(VLOOKUP($A467,Filtro!$A$5:$K$272,4,FALSE),0)","v":0},{"$f":"IFERROR(VLOOKUP($A467,Filtro!$A$5:$K$272,5,FALSE),0)","v":65}]
["80401063","0401063","Radiografía de túnel intercondíleo o radio-carpiano",0,{"$f":"IFERROR(VLOOKUP($A468,Filtro!$A$5:$K$272,3,FALSE),0)","v":0},{"$f":"IFERROR(VLOOKUP($A468,Filtro!$A$5:$K$272,4,FALSE),0)","v":0},{"$f":"IFERROR(VLOOKUP($A468,Filtro!$A$5:$K$272,5,FALSE),0)","v":0}]
["80401064","0401064","Apoyo fluoroscópico a procedimientos intraoperatorios y/o biopsia (no incluye el proc.)",{"$f":"SUM(E469:F469)","v":0},{"$f":"IFERROR(VLOOKUP($A469,Filtro!$A$5:$K$272,3,FALSE),0)","v":0},{"$f":"IFERROR(VLOOKUP($A469,Filtro!$A$5:$K$272,4,FALSE),0)","v":0},{"$f":"IFERROR(VLOOKUP($A469,Filtro!$A$5:$K$272,5,FALSE),0)","v":0}]
["80404002","0404002","Ecografía obstétrica",380,{"$f":"IFERROR(VLOOKUP($A470,Filtro!$A$5:$K$272,3,FALSE),0)","v":0},{"$f":"IFERROR(VLOOKUP($A470,Filtro!$A$5:$K$272,4,FALSE),0)","v":380},{"$f":"IFERROR(VLOOKUP($A470,Filtro!$A$5:$K$272,5,FALSE),0)","v":0}]
["80404003","0404003","Ecografía abdominal (incluye hígado, vía biliar, vesícula, páncreas, riñones, bazo, retroperitoneo y grandes vasos)",208,{"$f":"IFERROR(VLOOKUP($A471,Filtro!$A$5:$K$272,3,FALSE),0)","v":0},{"$f":"IFERROR(VLOOKUP($A471,Filtro!$A$5:$K$272,4,FALSE),0)","v":208},{"$f":"IFERROR(VLOOKUP($A471,Filtro!$A$5:$K$272,5,FALSE),0)","v":324}]
["80404004","0404004","Ecografía como apoyo a cirugía, o a procedimiento (de tórax, muscular, partes blandas, etc.)",0,{"$f":"IFERROR(VLOOKUP($A472,Filtro!$A$5:$K$272,3,FALSE),0)","v":0},{"$f":"IFERROR(VLOOKUP($A472,Filtro!$A$5:$K$272,4,FALSE),0)","v":0},{"$f":"IFERROR(VLOOKUP($A472,Filtro!$A$5:$K$272,5,FALSE),0)","v":0}]
["80404005","0404005","Ecografía transvaginal o transrectal",0,{"$f":"IFERROR(VLOOKUP($A473,Filtro!$A$5:$K$272,3,FALSE),0)","v":0},{"$f":"IFERROR(VLOOKUP($A473,Filtro!$A$5:$K$272,4,FALSE),0)","v":0},{"$f":"IFERROR(VLOOKUP($A473,Filtro!$A$5:$K$272,5,FALSE),0)","v":0}]
["80404006","0404006","Ecografía ginecológica, pelviana femenina u obstétrica con estudio fetal",43,{"$f":"IFERROR(VLOOKUP($A474,Filtro!$A$5:$K$272,3,FALSE),0)","v":0},{"$f":"IFERROR(VLOOKUP($A474,Filtro!$A$5:$K$272,4,FALSE),0)","v":43},{"$f":"IFERROR(VLOOKUP($A474,Filtro!$A$5:$K$272,5,FALSE),0)","v":5}]
["80404007","0404007","Ecografía transvaginal para seguimiento de ovulación, procedimiento completo (6-8 sesiones )",20,{"$f":"IFERROR(VLOOKUP($A475,Filtro!$A$5:$K$272,3,FALSE),0)","v":0},{"$f":"IFERROR(VLOOKUP($A475,Filtro!$A$5:$K$272,4,FALSE),0)","v":20},{"$f":"IFERROR(VLOOKUP($A475,Filtro!$A$5:$K$272,5,FALSE),0)","v":0}]
["80404008","0404008","Ecografía para seguimiento de ovulación, procedimiento completo (6 a 8 sesiones)",0,{"$f":"IFERROR(VLOOKUP($A476,Filtro!$A$5:$K$272,3,FALSE),0)","v":0},{"$f":"IFERROR(VLOOKUP($A476,Filtro!$A$5:$K$272,4,FALSE),0)","v":0},{"$f":"IFERROR(VLOOKUP($A476,Filtro!$A$5:$K$272,5,FALSE),0)","v":0}]
["80404009","0404009","Ecografía pélvica masculina (incluye vejiga y próstata)",0,{"$f":"IFERROR(VLOOKUP($A477,Filtro!$A$5:$K$272,3,FALSE),0)","v":0},{"$f":"IFERROR(VLOOKUP($A477,Filtro!$A$5:$K$272,4,FALSE),0)","v":0},{"$f":"IFERROR(VLOOKUP($A477,Filtro!$A$5:$K$272,5,FALSE),0)","v":0}]
["80404010","0404010","Ecografía renal (bilateral), o de bazo",0,{"$f":"IFERROR(VLOOKUP($A478,Filtro!$A$5:$K$272,3,FALSE),0)","v":0},{"$f":"IFERROR(VLOOKUP($A478,Filtro!$A$5:$K$272,4,FALSE),0)","v":0},{"$f":"IFERROR(VLOOKUP($A478,Filtro!$A$5:$K$272,5,FALSE),0)","v":0}]
["80404011","0404011","Ecografía encefálica (RN o lactante)",0,{"$f":"IFERROR(VLOOKUP($A479,Filtro!$A$5:$K$272,3,FALSE),0)","v":0},{"$f":"IFERROR(VLOOKUP($A479,Filtro!$A$5:$K$272,4,FALSE),0)","v":0},{"$f":"IFERROR(VLOOKUP($A479,Filtro!$A$5:$K$272,5,FALSE),0)","v":0}]
["80404012","0404012","Ecografía mamaria bilateral (incluye Doppler)",243,{"$f":"IFERROR(VLOOKUP($A480,Filtro!$A$5:$K$272,3,FALSE),0)","v":0},{"$f":"IFERROR(VLOOKUP($A480,Filtro!$A$5:$K$272,4,FALSE),0)","v":243},{"$f":"IFERROR(VLOOKUP($A480,Filtro!$A$5:$K$272,5,FALSE),0)","v":339}]
["80404013","0404013","Ecografía ocular, uno o ambos ojos.",0,{"$f":"IFERROR(VLOOKUP($A481,Filtro!$A$5:$K$272,3,FALSE),0)","v":0},{"$f":"IFERROR(VLOOKUP($A481,Filtro!$A$5:$K$272,4,FALSE),0)","v":0},{"$f":"IFERROR(VLOOKUP($A481,Filtro!$A$5:$K$272,5,FALSE),0)","v":0}]
["80404014","0404014","Ecografía testicular (uno o ambos) (Incluye Doppler)",0,{"$f":"IFERROR(VLOOKUP($A482,Filtro!$A$5:$K$272,3,FALSE),0)","v":0},{"$f":"IFERROR(VLOOKUP($A482,Filtro!$A$5:$K$272,4,FALSE),0)","v":0},{"$f":"IFERROR(VLOOKUP($A482,Filtro!$A$5:$K$272,5,FALSE),0)","v":0}]
["80404015","0404015","Ecografía tiroidea (Incluye Doppler)",0,{"$f":"IFERROR(VLOOKUP($A483,Filtro!$A$5:$K$272,3,FALSE),0)","v":0},{"$f":"IFERROR(VLOOKUP($A483,Filtro!$A$5:$K$272,4,FALSE),0)","v":0},{"$f":"IFERROR(VLOOKUP($A483,Filtro!$A$5:$K$272,5,FALSE),0)","v":0}]
["80404016","0404016","Ecografía vascular periférica, articular o de partes blandas",0,{"$f":"IFERROR(VLOOKUP($A484,Filtro!$A$5:$K$272,3,FALSE),0)","v":0},{"$f":"IFERROR(VLOOKUP($A484,Filtro!$A$5:$K$272,4,FALSE),0)","v":0},{"$f":"IFERROR(VLOOKUP($A484,Filtro!$A$5:$K$272,5,FALSE),0)","v":0}]
["80404018","0404018","Ecotomografía vascular periférica (bilateral), cervical (bilateral), abdominal o de otros órganos con doppler duplex                 ",0,{"$f":"IFERROR(VLOOKUP($A485,Filtro!$A$5:$K$272,3,FALSE),0)","v":0},{"$f":"IFERROR(VLOOKUP($A485,Filtro!$A$5:$K$272,4,FALSE),0)","v":0},{"$f":"IFERROR(VLOOKUP($A485,Filtro!$A$5:$K$272,5,FALSE),0)","v":0}]
["80404019","0404019","Ecotomografía vascular periférica (bilateral), cervical (bilateral), abdominal o de otros órganos con doppler color                ",0,{"$f":"IFERROR(VLOOKUP($A486,Filtro!$A$5:$K$272,3,FALSE),0)","v":0},{"$f":"IFERROR(VLOOKUP($A486,Filtro!$A$5:$K$272,4,FALSE),0)","v":0},{"$f":"IFERROR(VLOOKUP($A486,Filtro!$A$5:$K$272,5,FALSE),0)","v":0}]
[]
[null,"SECCIÓN B: PROCEDIMIENTOS APOYO CLÍNICO Y TERAPÉUTICO"]
[null,"CÓDIGOS","PROCEDIMIENTOS","Total","SAPU/SAR/SUR","Resto Establecimientos APS","Funcionario",null,"Compras de Servicios"]
[{"$nulls":6},"Médico","Otro"]
[null,"NEUROLOGÍA"]
["81101003",1101003,"Lumbar c/s manometria c/s queckensted   ",{"$f":"SUM(E492:F492)","v":0},{"$f":"IFERROR(VLOOKUP($A492,Filtro!$A$5:$K$272,3,FALSE),0)","v":0},{"$f":"IFERROR(VLOOKUP($A492,Filtro!$A$5:$K$272,4,FALSE),0)","v":0},{"$f":"IFERROR(VLOOKUP($A492,Filtro!$A$5:$K$272,5,FALSE),0)","v":0},{"$f":"IFERROR(VLOOKUP($A492,Filtro!$A$5:$K$272,6,FALSE),0)","v":0},{"$f":"IFERROR(VLOOKUP($A492,Filtro!$A$5:$K$272,7,FALSE),0)","v":0}]
[]
[null,"OFTALMOLOGÍA"]
["81201003",1201003,"cuantificacion de lagrimacion (test de   schirmer),  uno o                  ",{"$f":"SUM(E495:F495)","v":0},{"$f":"IFERROR(VLOOKUP($A495,Filtro!$A$5:$K$272,3,FALSE),0)","v":0},{"$f":"IFERROR(VLOOKUP($A495,Filtro!$A$5:$K$272,4,FALSE),0)","v":0},{"$f":"IFERROR(VLOOKUP($A495,Filtro!$A$5:$K$272,5,FALSE),0)","v":0},{"$f":"IFERROR(VLOOKUP($A495,Filtro!$A$5:$K$272,6,FALSE),0)","v":0},{"$f":"IFERROR(VLOOKUP($A495,Filtro!$A$5:$K$272,7,FALSE),0)","v":0}]
["81201004",1201004,"curva de tension aplanatica (por cada dia), c/ojo                                ",{"$f":"SUM(E496:F496)","v":0},{"$f":"IFERROR(VLOOKUP($A496,Filtro!$A$5:$K$272,3,FALSE),0)","v":0},{"$f":"IFERROR(VLOOKUP($A496,Filtro!$A$5:$K$272,4,FALSE),0)","v":0},{"$f":"IFERROR(VLOOKUP($A496,Filtro!$A$5:$K$272,5,FALSE),0)","v":0},{"$f":"IFERROR(VLOOKUP($A496,Filtro!$A$5:$K$272,6,FALSE),0)","v":0},{"$f":"IFERROR(VLOOKUP($A496,Filtro!$A$5:$K$272,7,FALSE),0)","v":0}]
["81201005",1201005,"diploscopia cuantitativa, ambos ojos                                                      ",0,{"$f":"IFERROR(VLOOKUP($A497,Filtro!$A$5:$K$272,3,FALSE),0)","v":0},{"$f":"IFERROR(VLOOKUP($A497,Filtro!$A$5:$K$272,4,FALSE),0)","v":0},{"$f":"IFERROR(VLOOKUP($A497,Filtro!$A$5:$K$272,5,FALSE),0)","v":0},{"$f":"IFERROR(VLOOKUP($A497,Filtro!$A$5:$K$272,6,FALSE),0)","v":0},{"$f":"IFERROR(VLOOKUP($A497,Filtro!$A$5:$K$272,7,FALSE),0)","v":0}]
["81201009",1201009,"exploracion sensoriomotora: estrabismo, estudio completo ,               ",0,{"$f":"IFERROR(VLOOKUP($A498,Filtro!$A$5:$K$272,3,FALSE),0)","v":0},{"$f":"IFERROR(VLOOKUP($A498,Filtro!$A$5:$K$272,4,FALSE),0)","v":0},{"$f":"IFERROR(VLOOKUP($A498,Filtro!$A$5:$K$272,5,FALSE),0)","v":0},{"$f":"IFERROR(VLOOKUP($A498,Filtro!$A$5:$K$272,6,FALSE),0)","v":0},{"$f":"IFERROR(VLOOKUP($A498,Filtro!$A$5:$K$272,7,FALSE),0)","v":0}]
["81201012",1201012,"retinografia, ambos ojos                                                                           ",0,{"$f":"IFERROR(VLOOKUP($A499,Filtro!$A$5:$K$272,3,FALSE),0)","v":0},{"$f":"IFERROR(VLOOKUP($A499,Filtro!$A$5:$K$272,4,FALSE),0)","v":0},{"$f":"IFERROR(VLOOKUP($A499,Filtro!$A$5:$K$272,5,FALSE),0)","v":0},{"$f":"IFERROR(VLOOKUP($A499,Filtro!$A$5:$K$272,6,FALSE),0)","v":0},{"$f":"IFERROR(VLOOKUP($A499,Filtro!$A$5:$K$272,7,FALSE),0)","v":0}]
["81201014",1201014,"tonometria ocular, cualquier tecnica, c/ojo                                            ",0,{"$f":"IFERROR(VLOOKUP($A500,Filtro!$A$5:$K$272,3,FALSE),0)","v":0},{"$f":"IFERROR(VLOOKUP($A500,Filtro!$A$5:$K$272,4,FALSE),0)","v":0},{"$f":"IFERROR(VLOOKUP($A500,Filtro!$A$5:$K$272,5,FALSE),0)","v":0},{"$f":"IFERROR(VLOOKUP($A500,Filtro!$A$5:$K$272,6,FALSE),0)","v":0},{"$f":"IFERROR(VLOOKUP($A500,Filtro!$A$5:$K$272,7,FALSE),0)","v":0}]
["81201015",1201015,"tratamiento ortoptico y/ o pleoptico (por sesion) ,                               ",0,{"$f":"IFERROR(VLOOKUP($A501,Filtro!$A$5:$K$272,3,FALSE),0)","v":0},{"$f":"IFERROR(VLOOKUP($A501,Filtro!$A$5:$K$272,4,FALSE),0)","v":0},{"$f":"IFERROR(VLOOKUP($A501,Filtro!$A$5:$K$272,5,FALSE),0)","v":0},{"$f":"IFERROR(VLOOKUP($A501,Filtro!$A$5:$K$272,6,FALSE),0)","v":0},{"$f":"IFERROR(VLOOKUP($A501,Filtro!$A$5:$K$272,7,FALSE),0)","v":0}]
["81201019",1201019,"Exploracion vitreorretinal, ambos ojos                                                       ",2,{"$f":"IFERROR(VLOOKUP($A502,Filtro!$A$5:$K$272,3,FALSE),0)","v":2},{"$f":"IFERROR(VLOOKUP($A502,Filtro!$A$5:$K$272,4,FALSE),0)","v":0},{"$f":"IFERROR(VLOOKUP($A502,Filtro!$A$5:$K$272,5,FALSE),0)","v":0},{"$f":"IFERROR(VLOOKUP($A502,Filtro!$A$5:$K$272,6,FALSE),0)","v":2},{"$f":"IFERROR(VLOOKUP($A502,Filtro!$A$5:$K$272,7,FALSE),0)","v":0}]
["81201029",1201029,"Cuerpo extrano conjuntival y/o corneal en adultos                                 ",59,{"$f":"IFERROR(VLOOKUP($A503,Filtro!$A$5:$K$272,3,FALSE),0)","v":55},{"$f":"IFERROR(VLOOKUP($A503,Filtro!$A$5:$K$272,4,FALSE),0)","v":4},{"$f":"IFERROR(VLOOKUP($A503,Filtro!$A$5:$K$272,5,FALSE),0)","v":2},{"$f":"IFERROR(VLOOKUP($A503,Filtro!$A$5:$K$272,6,FALSE),0)","v":57},{"$f":"IFERROR(VLOOKUP($A503,Filtro!$A$5:$K$272,7,FALSE),0)","v":0}]
["81201042",1201042,"Campimetría computarizada, c/ojo (excluye UAPO)                            ",0,{"$f":"IFERROR(VLOOKUP($A504,Filtro!$A$5:$K$272,3,FALSE),0)","v":0},{"$f":"IFERROR(VLOOKUP($A504,Filtro!$A$5:$K$272,4,FALSE),0)","v":0},{"$f":"IFERROR(VLOOKUP($A504,Filtro!$A$5:$K$272,5,FALSE),0)","v":0},{"$f":"IFERROR(VLOOKUP($A504,Filtro!$A$5:$K$272,6,FALSE),0)","v":0},{"$f":"IFERROR(VLOOKUP($A504,Filtro!$A$5:$K$272,7,FALSE),0)","v":0}]
["81201042A",1201042,"Campimetría computarizada, c/ojo (en UAPO)                                  ",0,{"$f":"IFERROR(VLOOKUP($A505,Filtro!$A$5:$K$272,3,FALSE),0)","v":0},{"$f":"IFERROR(VLOOKUP($A505,Filtro!$A$5:$K$272,4,FALSE),0)","v":0},{"$f":"IFERROR(VLOOKUP($A505,Filtro!$A$5:$K$272,5,FALSE),0)","v":0},{"$f":"IFERROR(VLOOKUP($A505,Filtro!$A$5:$K$272,6,FALSE),0)","v":0},{"$f":"IFERROR(VLOOKUP($A505,Filtro!$A$5:$K$272,7,FALSE),0)","v":0}]
[null,"TOTAL",null,{"$f":"SUM(D495:D505)","v":61},{"$f":"SUM(E495:E505)","v":57},{"$f":"SUM(F495:F505)","v":4},2,59,0]
[]
[null,"OTORRINOLARINGOLOGÍA"]
["81301025",1301025,"Taponamiento nasal anterior (proc. aut.)",{"$f":"SUM(E509:F509)","v":23},{"$f":"IFERROR(VLOOKUP($A509,Filtro!$A$5:$K$272,3,FALSE),0)","v":21},{"$f":"IFERROR(VLOOKUP($A509,Filtro!$A$5:$K$272,4,FALSE),0)","v":2},{"$f":"IFERROR(VLOOKUP($A509,Filtro!$A$5:$K$272,5,FALSE),0)","v":9},{"$f":"IFERROR(VLOOKUP($A509,Filtro!$A$5:$K$272,6,FALSE),0)","v":14},{"$f":"IFERROR(VLOOKUP($A509,Filtro!$A$5:$K$272,7,FALSE),0)","v":0}]
["81301026",1301026,"Taponamiento nasal posterior",{"$f":"SUM(E510:F510)","v":3},{"$f":"IFERROR(VLOOKUP($A510,Filtro!$A$5:$K$272,3,FALSE),0)","v":0},{"$f":"IFERROR(VLOOKUP($A510,Filtro!$A$5:$K$272,4,FALSE),0)","v":3},{"$f":"IFERROR(VLOOKUP($A510,Filtro!$A$5:$K$272,5,FALSE),0)","v":0},{"$f":"IFERROR(VLOOKUP($A510,Filtro!$A$5:$K$272,6,FALSE),0)","v":3},{"$f":"IFERROR(VLOOKUP($A510,Filtro!$A$5:$K$272,7,FALSE),0)","v":0}]
["81301029",1301029,"Cuerpo extraño en fosas nasales, extraccion en adultos        ",1,{"$f":"IFERROR(VLOOKUP($A511,Filtro!$A$5:$K$272,3,FALSE),0)","v":1},{"$f":"IFERROR(VLOOKUP($A511,Filtro!$A$5:$K$272,4,FALSE),0)","v":0},{"$f":"IFERROR(VLOOKUP($A511,Filtro!$A$5:$K$272,5,FALSE),0)","v":0},{"$f":"IFERROR(VLOOKUP($A511,Filtro!$A$5:$K$272,6,FALSE),0)","v":1},{"$f":"IFERROR(VLOOKUP($A511,Filtro!$A$5:$K$272,7,FALSE),0)","v":0}]
["81301030",1301030,"Cuerpo extraño en fosas nasales, extraccion en niños        ",0,{"$f":"IFERROR(VLOOKUP($A512,Filtro!$A$5:$K$272,3,FALSE),0)","v":0},{"$f":"IFERROR(VLOOKUP($A512,Filtro!$A$5:$K$272,4,FALSE),0)","v":0},{"$f":"IFERROR(VLOOKUP($A512,Filtro!$A$5:$K$272,5,FALSE),0)","v":0},{"$f":"IFERROR(VLOOKUP($A512,Filtro!$A$5:$K$272,6,FALSE),0)","v":0},{"$f":"IFERROR(VLOOKUP($A512,Filtro!$A$5:$K$272,7,FALSE),0)","v":0}]
["81301042",1301042,"Trompa de eustaquio, insuflacion instrumental (proc. Aut.) en adultos                                                                             ",0,{"$f":"IFERROR(VLOOKUP($A513,Filtro!$A$5:$K$272,3,FALSE),0)","v":0},{"$f":"IFERROR(VLOOKUP($A513,Filtro!$A$5:$K$272,4,FALSE),0)","v":0},{"$f":"IFERROR(VLOOKUP($A513,Filtro!$A$5:$K$272,5,FALSE),0)","v":0},{"$f":"IFERROR(VLOOKUP($A513,Filtro!$A$5:$K$272,6,FALSE),0)","v":0},{"$f":"IFERROR(VLOOKUP($A513,Filtro!$A$5:$K$272,7,FALSE),0)","v":0}]
["81301043",1301043,"Trompa de eustaquio, insuflacion instrumental (proc. Aut.) en ninos                                                                                     ",0,{"$f":"IFERROR(VLOOKUP($A514,Filtro!$A$5:$K$272,3,FALSE),0)","v":0},{"$f":"IFERROR(VLOOKUP($A514,Filtro!$A$5:$K$272,4,FALSE),0)","v":0},{"$f":"IFERROR(VLOOKUP($A514,Filtro!$A$5:$K$272,5,FALSE),0)","v":0},{"$f":"IFERROR(VLOOKUP($A514,Filtro!$A$5:$K$272,6,FALSE),0)","v":0},{"$f":"IFERROR(VLOOKUP($A514,Filtro!$A$5:$K$272,7,FALSE),0)","v":0}]
[null,"TOTAL",null,{"$f":"SUM(D509:D514)","v":27},{"$f":"SUM(E509:E514)","v":22},5,9,18,0]
[]
[null,"DERMATOLOGÍA Y TEGUMENTOS"]
["81601110",1601110,"Curetaje de lesiones virales o similares hasta 10 lesiones                          ",{"$f":"SUM(E518:F518)","v":5},{"$f":"IFERROR(VLOOKUP($A518,Filtro!$A$5:$K$272,3,FALSE),0)","v":0},{"$f":"IFERROR(VLOOKUP($A518,Filtro!$A$5:$K$272,4,FALSE),0)","v":5},{"$f":"IFERROR(VLOOKUP($A518,Filtro!$A$5:$K$272,5,FALSE),0)","v":0},{"$f":"IFERROR(VLOOKUP($A518,Filtro!$A$5:$K$272,6,FALSE),0)","v":5},{"$f":"IFERROR(VLOOKUP($A518,Filtro!$A$5:$K$272,7,FALSE),0)","v":0}]
["81601115",1601115,"Implantes Subcutáneos, instalación o retiro",{"$f":"SUM(E519:F519)","v":197},{"$f":"IFERROR(VLOOKUP($A519,Filtro!$A$5:$K$272,3,FALSE),0)","v":0},{"$f":"IFERROR(VLOOKUP($A519,Filtro!$A$5:$K$272,4,FALSE),0)","v":197},{"$f":"IFERROR(VLOOKUP($A519,Filtro!$A$5:$K$272,5,FALSE),0)","v":0},{"$f":"IFERROR(VLOOKUP($A519,Filtro!$A$5:$K$272,6,FALSE),0)","v":192},{"$f":"IFERROR(VLOOKUP($A519,Filtro!$A$5:$K$272,7,FALSE),0)","v":0}]
[null,"TOTAL",null,{"$f":"SUM(D518:D519)","v":202},{"$f":"SUM(E518:E519)","v":0},{"$f":"SUM(F518:F519)","v":202},0,197,0]
[]
[null,"CARDIOLOGÍA"]
["81701001","1701001","Electrocardiograma",{"$f":"SUM(E523:F523)","v":{"v":13119,"d":"13,119"}},{"$f":"IFERROR(VLOOKUP($A523,Filtro!$A$5:$K$272,3,FALSE),0)","v":{"v":3058,"d":"3,058"}},{"$f":"IFERROR(VLOOKUP($A523,Filtro!$A$5:$K$272,4,FALSE),0)","v":{"v":10061,"d":"10,061"}},{"$f":"IFERROR(VLOOKUP($A523,Filtro!$A$5:$K$272,5,FALSE),0)","v":0},{"$f":"IFERROR(VLOOKUP($A523,Filtro!$A$5:$K$272,6,FALSE),0)","v":{"v":12760,"d":"12,760"}},{"$f":"IFERROR(VLOOKUP($A523,Filtro!$A$5:$K$272,7,FALSE),0)","v":{"v":3440,"d":"3,440"}}]
["81701006","1701006","E.C.G. Continuo (test holter o similares, por ej. variabilidad de la frecuencia cardiaca y/o alta resolución  del st y/o despolarización tardía);20 a 24 horas de registro                                                                         ",{"$f":"SUM(E524:F524)","v":0},{"$f":"IFERROR(VLOOKUP($A524,Filtro!$A$5:$K$272,3,FALSE),0)","v":0},{"$f":"IFERROR(VLOOKUP($A524,Filtro!$A$5:$K$272,4,FALSE),0)","v":0},{"$f":"IFERROR(VLOOKUP($A524,Filtro!$A$5:$K$272,5,FALSE),0)","v":0},{"$f":"IFERROR(VLOOKUP($A524,Filtro!$A$5:$K$272,6,FALSE),0)","v":0},{"$f":"IFERROR(VLOOKUP($A524,Filtro!$A$5:$K$272,7,FALSE),0)","v":0}]
["81701009","1701009","Monitoreo continuo de presión arterial",{"$f":"SUM(E525:F525)","v":{"v":6091,"d":"6,091"}},{"$f":"IFERROR(VLOOKUP($A525,Filtro!$A$5:$K$272,3,FALSE),0)","v":{"v":1166,"d":"1,166"}},{"$f":"IFERROR(VLOOKUP($A525,Filtro!$A$5:$K$272,4,FALSE),0)","v":{"v":4925,"d":"4,925"}},{"$f":"IFERROR(VLOOKUP($A525,Filtro!$A$5:$K$272,5,FALSE),0)","v":0},{"$f":"IFERROR(VLOOKUP($A525,Filtro!$A$5:$K$272,6,FALSE),0)","v":{"v":5789,"d":"5,789"}},{"$f":"IFERROR(VLOOKUP($A525,Filtro!$A$5:$K$272,7,FALSE),0)","v":36}]
["81707038",null,"Monitoreo Ambulatorio de Presión Arterial (procedimiento finalizado)",{"$f":"SUM(E526:F526)","v":{"v":3995,"d":"3,995"}},{"$f":"IFERROR(VLOOKUP($A526,Filtro!$A$5:$K$272,3,FALSE),0)","v":543},{"$f":"IFERROR(VLOOKUP($A526,Filtro!$A$5:$K$272,4,FALSE),0)","v":{"v":3452,"d":"3,452"}},{"$f":"IFERROR(VLOOKUP($A526,Filtro!$A$5:$K$272,5,FALSE),0)","v":0},{"$f":"IFERROR(VLOOKUP($A526,Filtro!$A$5:$K$272,6,FALSE),0)","v":{"v":3914,"d":"3,914"}},{"$f":"IFERROR(VLOOKUP($A526,Filtro!$A$5:$K$272,7,FALSE),0)","v":0}]
[null,"TOTAL",null,{"$f":"SUM(D523:D526)","v":{"v":23205,"d":"23,205"}},{"$f":"SUM(E523:E526)","v":{"v":4767,"d":"4,767"}},{"v":18438,"d":"18,438"},0,{"$f":"SUM(H523:H526)","v":{"v":22463,"d":"22,463"}},{"v":3476,"d":"3,476"}]
[]
[null,"NEUMOLOGÍA"]
["81707001",1707001,"Espirometría Basal                                                                                       ",{"$f":"SUM(E530:F530)","v":564},{"$f":"IFERROR(VLOOKUP($A530,Filtro!$A$5:$K$272,3,FALSE),0)","v":0},{"$f":"IFERROR(VLOOKUP($A530,Filtro!$A$5:$K$272,4,FALSE),0)","v":564},{"$f":"IFERROR(VLOOKUP($A530,Filtro!$A$5:$K$272,5,FALSE),0)","v":0},{"$f":"IFERROR(VLOOKUP($A530,Filtro!$A$5:$K$272,6,FALSE),0)","v":564},{"$f":"IFERROR(VLOOKUP($A530,Filtro!$A$5:$K$272,7,FALSE),0)","v":0}]
["81707002",1707002,"Espirometria basal y con broncodilatador                                                         ",{"$f":"SUM(E531:F531)","v":273},{"$f":"IFERROR(VLOOKUP($A531,Filtro!$A$5:$K$272,3,FALSE),0)","v":0},{"$f":"IFERROR(VLOOKUP($A531,Filtro!$A$5:$K$272,4,FALSE),0)","v":273},{"$f":"IFERROR(VLOOKUP($A531,Filtro!$A$5:$K$272,5,FALSE),0)","v":0},{"$f":"IFERROR(VLOOKUP($A531,Filtro!$A$5:$K$272,6,FALSE),0)","v":265},{"$f":"IFERROR(VLOOKUP($A531,Filtro!$A$5:$K$272,7,FALSE),0)","v":0}]
["81707004",1707004,"Test de provocacion con ejercicio                                                                      ",25,{"$f":"IFERROR(VLOOKUP($A532,Filtro!$A$5:$K$272,3,FALSE),0)","v":0},{"$f":"IFERROR(VLOOKUP($A532,Filtro!$A$5:$K$272,4,FALSE),0)","v":25},{"$f":"IFERROR(VLOOKUP($A532,Filtro!$A$5:$K$272,5,FALSE),0)","v":0},{"$f":"IFERROR(VLOOKUP($A532,Filtro!$A$5:$K$272,6,FALSE),0)","v":25},{"$f":"IFERROR(VLOOKUP($A532,Filtro!$A$5:$K$272,7,FALSE),0)","v":0}]
["81707030",1707030,"Aerosolterapia (Nebulización)    ",{"v":1316,"d":"1,316"},{"$f":"IFERROR(VLOOKUP($A533,Filtro!$A$5:$K$272,3,FALSE),0)","v":{"v":1208,"d":"1,208"}},{"$f":"IFERROR(VLOOKUP($A533,Filtro!$A$5:$K$272,4,FALSE),0)","v":108},{"$f":"IFERROR(VLOOKUP($A533,Filtro!$A$5:$K$272,5,FALSE),0)","v":25},{"$f":"IFERROR(VLOOKUP($A533,Filtro!$A$5:$K$272,6,FALSE),0)","v":{"v":1251,"d":"1,251"}},{"$f":"IFERROR(VLOOKUP($A533,Filtro!$A$5:$K$272,7,FALSE),0)","v":0}]
[null,"TOTAL",null,{"$f":"SUM(D530:D533)","v":{"v":2178,"d":"2,178"}},{"$f":"SUM(E530:E533)","v":{"v":1208,"d":"1,208"}},970,25,{"v":2105,"d":"2,105"},0]
[]
[null,"GASTROENTEROLOGÍA"]
["81801023",1801023,"Intubacion con sonda gastrica                                                                ",{"$f":"SUM(E537:F537)","v":31},{"$f":"IFERROR(VLOOKUP($A537,Filtro!$A$5:$K$272,3,FALSE),0)","v":25},{"$f":"IFERROR(VLOOKUP($A537,Filtro!$A$5:$K$272,4,FALSE),0)","v":6},{"$f":"IFERROR(VLOOKUP($A537,Filtro!$A$5:$K$272,5,FALSE),0)","v":0},{"$f":"IFERROR(VLOOKUP($A537,Filtro!$A$5:$K$272,6,FALSE),0)","v":31},{"$f":"IFERROR(VLOOKUP($A537,Filtro!$A$5:$K$272,7,FALSE),0)","v":0}]
["81801042",1801042,"Vaciamiento manual de fecaloma                                                                   ",{"$f":"SUM(E538:F538)","v":0},{"$f":"IFERROR(VLOOKUP($A538,Filtro!$A$5:$K$272,3,FALSE),0)","v":0},{"$f":"IFERROR(VLOOKUP($A538,Filtro!$A$5:$K$272,4,FALSE),0)","v":0},{"$f":"IFERROR(VLOOKUP($A538,Filtro!$A$5:$K$272,5,FALSE),0)","v":0},{"$f":"IFERROR(VLOOKUP($A538,Filtro!$A$5:$K$272,6,FALSE),0)","v":0},{"$f":"IFERROR(VLOOKUP($A538,Filtro!$A$5:$K$272,7,FALSE),0)","v":0}]
["81801001",1801001,"Gastroduodenoscopía (incluye esofagoscopía)                                                      ",0,{"$f":"IFERROR(VLOOKUP($A539,Filtro!$A$5:$K$272,3,FALSE),0)","v":0},{"$f":"IFERROR(VLOOKUP($A539,Filtro!$A$5:$K$272,4,FALSE),0)","v":0},{"$f":"IFERROR(VLOOKUP($A539,Filtro!$A$5:$K$272,5,FALSE),0)","v":0},{"$f":"IFERROR(VLOOKUP($A539,Filtro!$A$5:$K$272,6,FALSE),0)","v":0},{"$f":"IFERROR(VLOOKUP($A539,Filtro!$A$5:$K$272,7,FALSE),0)","v":0}]
[null,"TOTAL",null,{"$f":"SUM(D537:D539)","v":31},{"$f":"SUM(E537:E539)","v":25},{"$f":"SUM(F537:F539)","v":6},{"$f":"SUM(G537:G539)","v":0},{"$f":"SUM(H537:H539)","v":31},{"$f":"SUM(I537:I539)","v":0}]
[]
[null,"UROLOGÍA"]
["81901019",1901019,"Instilacion vesical (incluye colocacion de sonda) proc. Aut.                                      ",{"$f":"SUM(E543:F543)","v":182},{"$f":"IFERROR(VLOOKUP($A543,Filtro!$A$5:$K$272,3,FALSE),0)","v":151},{"$f":"IFERROR(VLOOKUP($A543,Filtro!$A$5:$K$272,4,FALSE),0)","v":31},{"$f":"IFERROR(VLOOKUP($A543,Filtro!$A$5:$K$272,5,FALSE),0)","v":1},{"$f":"IFERROR(VLOOKUP($A543,Filtro!$A$5:$K$272,6,FALSE),0)","v":177},{"$f":"IFERROR(VLOOKUP($A543,Filtro!$A$5:$K$272,7,FALSE),0)","v":0}]
["81901022",1901022,"Vac. Vesical por sonda uretral, (proc. Aut.)                                                    ",{"$f":"SUM(E544:F544)","v":90},{"$f":"IFERROR(VLOOKUP($A544,Filtro!$A$5:$K$272,3,FALSE),0)","v":44},{"$f":"IFERROR(VLOOKUP($A544,Filtro!$A$5:$K$272,4,FALSE),0)","v":46},{"$f":"IFERROR(VLOOKUP($A544,Filtro!$A$5:$K$272,5,FALSE),0)","v":0},{"$f":"IFERROR(VLOOKUP($A544,Filtro!$A$5:$K$272,6,FALSE),0)","v":90},{"$f":"IFERROR(VLOOKUP($A544,Filtro!$A$5:$K$272,7,FALSE),0)","v":0}]
[null,"TOTAL",null,{"$f":"SUM(D543:D544)","v":272},{"$f":"SUM(E543:E544)","v":195},{"$f":"SUM(F543:F544)","v":77},{"$f":"SUM(G543:G544)","v":1},267,0]
[]
[null,"GINECOLOGÍA"]
["82001015",2001015,"Colocación o extracción de dispositivo intrauterino (no incluye el valor del dispositivo)                    ",{"$f":"SUM(E548:F548)","v":147},{"$f":"IFERROR(VLOOKUP($A548,Filtro!$A$5:$K$272,3,FALSE),0)","v":0},{"$f":"IFERROR(VLOOKUP($A548,Filtro!$A$5:$K$272,4,FALSE),0)","v":147},{"$f":"IFERROR(VLOOKUP($A548,Filtro!$A$5:$K$272,5,FALSE),0)","v":0},{"$f":"IFERROR(VLOOKUP($A548,Filtro!$A$5:$K$272,6,FALSE),0)","v":139},{"$f":"IFERROR(VLOOKUP($A548,Filtro!$A$5:$K$272,7,FALSE),0)","v":0}]
[]
[null,"ORTOPEDIA Y TRAUMATOLOGÍA"]
["82101001",2101001,"Infiltracion local medicamentos (bursas, tendones, yuxtaarticulares y/o intraarticulares",{"$f":"SUM(E551:F551)","v":0},{"$f":"IFERROR(VLOOKUP($A551,Filtro!$A$5:$K$272,3,FALSE),0)","v":0},{"$f":"IFERROR(VLOOKUP($A551,Filtro!$A$5:$K$272,4,FALSE),0)","v":0},{"$f":"IFERROR(VLOOKUP($A551,Filtro!$A$5:$K$272,5,FALSE),0)","v":0},{"$f":"IFERROR(VLOOKUP($A551,Filtro!$A$5:$K$272,6,FALSE),0)","v":0},{"$f":"IFERROR(VLOOKUP($A551,Filtro!$A$5:$K$272,7,FALSE),0)","v":0}]
["82101002",2101002,"Procedimiento para exploraciones radiologicas (incluye maniobra e inyeccion del medio de contraste)  BM18A  Revisar en BM Colocación valva",{"$f":"SUM(E552:F552)","v":0},{"$f":"IFERROR(VLOOKUP($A552,Filtro!$A$5:$K$272,3,FALSE),0)","v":0},{"$f":"IFERROR(VLOOKUP($A552,Filtro!$A$5:$K$272,4,FALSE),0)","v":0},{"$f":"IFERROR(VLOOKUP($A552,Filtro!$A$5:$K$272,5,FALSE),0)","v":0},{"$f":"IFERROR(VLOOKUP($A552,Filtro!$A$5:$K$272,6,FALSE),0)","v":0},{"$f":"IFERROR(VLOOKUP($A552,Filtro!$A$5:$K$272,7,FALSE),0)","v":0}]
["82106005",2106005,"Rodillera, bota larga o corta de yeso",117,{"$f":"IFERROR(VLOOKUP($A553,Filtro!$A$5:$K$272,3,FALSE),0)","v":116},{"$f":"IFERROR(VLOOKUP($A553,Filtro!$A$5:$K$272,4,FALSE),0)","v":1},{"$f":"IFERROR(VLOOKUP($A553,Filtro!$A$5:$K$272,5,FALSE),0)","v":0},{"$f":"IFERROR(VLOOKUP($A553,Filtro!$A$5:$K$272,6,FALSE),0)","v":117},{"$f":"IFERROR(VLOOKUP($A553,Filtro!$A$5:$K$272,7,FALSE),0)","v":0}]
["82106007",2106007,"Velpeau",2,{"$f":"IFERROR(VLOOKUP($A554,Filtro!$A$5:$K$272,3,FALSE),0)","v":1},{"$f":"IFERROR(VLOOKUP($A554,Filtro!$A$5:$K$272,4,FALSE),0)","v":1},{"$f":"IFERROR(VLOOKUP($A554,Filtro!$A$5:$K$272,5,FALSE),0)","v":0},{"$f":"IFERROR(VLOOKUP($A554,Filtro!$A$5:$K$272,6,FALSE),0)","v":2},{"$f":"IFERROR(VLOOKUP($A554,Filtro!$A$5:$K$272,7,FALSE),0)","v":0}]
["82106006",2106006,"Yeso antebraquial c/s ferula digital",10,{"$f":"IFERROR(VLOOKUP($A555,Filtro!$A$5:$K$272,3,FALSE),0)","v":9},{"$f":"IFERROR(VLOOKUP($A555,Filtro!$A$5:$K$272,4,FALSE),0)","v":1},{"$f":"IFERROR(VLOOKUP($A555,Filtro!$A$5:$K$272,5,FALSE),0)","v":0},{"$f":"IFERROR(VLOOKUP($A555,Filtro!$A$5:$K$272,6,FALSE),0)","v":10},{"$f":"IFERROR(VLOOKUP($A555,Filtro!$A$5:$K$272,7,FALSE),0)","v":0}]
["82106004",2106004,"Yeso braquicarpiano",18,{"$f":"IFERROR(VLOOKUP($A556,Filtro!$A$5:$K$272,3,FALSE),0)","v":18},{"$f":"IFERROR(VLOOKUP($A556,Filtro!$A$5:$K$272,4,FALSE),0)","v":0},{"$f":"IFERROR(VLOOKUP($A556,Filtro!$A$5:$K$272,5,FALSE),0)","v":0},{"$f":"IFERROR(VLOOKUP($A556,Filtro!$A$5:$K$272,6,FALSE),0)","v":18},{"$f":"IFERROR(VLOOKUP($A556,Filtro!$A$5:$K$272,7,FALSE),0)","v":0}]
["82107003",2107003,"Luxaciones de articulaciones menores (el resto)      ",90,{"$f":"IFERROR(VLOOKUP($A557,Filtro!$A$5:$K$272,3,FALSE),0)","v":89},{"$f":"IFERROR(VLOOKUP($A557,Filtro!$A$5:$K$272,4,FALSE),0)","v":1},{"$f":"IFERROR(VLOOKUP($A557,Filtro!$A$5:$K$272,5,FALSE),0)","v":0},{"$f":"IFERROR(VLOOKUP($A557,Filtro!$A$5:$K$272,6,FALSE),0)","v":90},{"$f":"IFERROR(VLOOKUP($A557,Filtro!$A$5:$K$272,7,FALSE),0)","v":0}]
[null,"TOTAL",null,{"$f":"SUM(D551:D557)","v":237},{"$f":"SUM(E551:E557)","v":233},{"$f":"SUM(F551:F557)","v":4},{"$f":"SUM(G551:G557)","v":0},237,0]
[]
[null," SECCIÓN C: INTERVENCIONES QUIRÚRGICAS MENORES"]
["81602201",1602201,"Biopsia de piel y/o mucosa por curetaje o sección tangencial c/s electro x 1 sesion        ",{"$f":"SUM(E561:F561)","v":6},{"$f":"IFERROR(VLOOKUP($A561,Filtro!$A$5:$K$272,3,FALSE),0)","v":0},{"$f":"IFERROR(VLOOKUP($A561,Filtro!$A$5:$K$272,4,FALSE),0)","v":6},{"$f":"IFERROR(VLOOKUP($A561,Filtro!$A$5:$K$272,5,FALSE),0)","v":6},{"$f":"IFERROR(VLOOKUP($A561,Filtro!$A$5:$K$272,6,FALSE),0)","v":0},{"$f":"IFERROR(VLOOKUP($A561,Filtro!$A$5:$K$272,7,FALSE),0)","v":3}]
["81602202",1602202,"Extirpacion de, reparacion o biopsia total o parcial, de lesiones benignas cutáneas por excision cabeza, cuello, genitales, hasta 3 lesiones                                                                  ",{"$f":"SUM(E562:F562)","v":7},{"$f":"IFERROR(VLOOKUP($A562,Filtro!$A$5:$K$272,3,FALSE),0)","v":0},{"$f":"IFERROR(VLOOKUP($A562,Filtro!$A$5:$K$272,4,FALSE),0)","v":7},{"$f":"IFERROR(VLOOKUP($A562,Filtro!$A$5:$K$272,5,FALSE),0)","v":7},{"$f":"IFERROR(VLOOKUP($A562,Filtro!$A$5:$K$272,6,FALSE),0)","v":0},{"$f":"IFERROR(VLOOKUP($A562,Filtro!$A$5:$K$272,7,FALSE),0)","v":5}]
["81602203",1602203,"Extirpacion de, reparacion o biopsia total o parcial, de lesiones benignas cutáneas por excision resto de cuerpo hasta 3 lesiones                                                                              ",4,{"$f":"IFERROR(VLOOKUP($A563,Filtro!$A$5:$K$272,3,FALSE),0)","v":0},{"$f":"IFERROR(VLOOKUP($A563,Filtro!$A$5:$K$272,4,FALSE),0)","v":4},{"$f":"IFERROR(VLOOKUP($A563,Filtro!$A$5:$K$272,5,FALSE),0)","v":4},{"$f":"IFERROR(VLOOKUP($A563,Filtro!$A$5:$K$272,6,FALSE),0)","v":0},{"$f":"IFERROR(VLOOKUP($A563,Filtro!$A$5:$K$272,7,FALSE),0)","v":4}]
["81602204",1602204,"Extirpacion de, reparacion o biopsia total o parcial, de lesiones benignas cutáneas por excision cabeza, cuello, genitales, desde 4 hasta 6 lesiones                                              ",4,{"$f":"IFERROR(VLOOKUP($A564,Filtro!$A$5:$K$272,3,FALSE),0)","v":0},{"$f":"IFERROR(VLOOKUP($A564,Filtro!$A$5:$K$272,4,FALSE),0)","v":4},{"$f":"IFERROR(VLOOKUP($A564,Filtro!$A$5:$K$272,5,FALSE),0)","v":4},{"$f":"IFERROR(VLOOKUP($A564,Filtro!$A$5:$K$272,6,FALSE),0)","v":0},{"$f":"IFERROR(VLOOKUP($A564,Filtro!$A$5:$K$272,7,FALSE),0)","v":4}]
["81602205",1602205,"Extirpacion de, reparacion o biopsia total o parcial, de lesiones benignas cutáneas por excision resto de cuerpo desde 4 hasta 6 lesiones                                                             ",2,{"$f":"IFERROR(VLOOKUP($A565,Filtro!$A$5:$K$272,3,FALSE),0)","v":0},{"$f":"IFERROR(VLOOKUP($A565,Filtro!$A$5:$K$272,4,FALSE),0)","v":2},{"$f":"IFERROR(VLOOKUP($A565,Filtro!$A$5:$K$272,5,FALSE),0)","v":2},{"$f":"IFERROR(VLOOKUP($A565,Filtro!$A$5:$K$272,6,FALSE),0)","v":0},{"$f":"IFERROR(VLOOKUP($A565,Filtro!$A$5:$K$272,7,FALSE),0)","v":1}]
["81602206",1602206,"Extirpacion de lesiones benignas por sec tangencial ,curetaje,y/o fulguracion hasta 15 lesiones   ",4,{"$f":"IFERROR(VLOOKUP($A566,Filtro!$A$5:$K$272,3,FALSE),0)","v":0},{"$f":"IFERROR(VLOOKUP($A566,Filtro!$A$5:$K$272,4,FALSE),0)","v":4},{"$f":"IFERROR(VLOOKUP($A566,Filtro!$A$5:$K$272,5,FALSE),0)","v":2},{"$f":"IFERROR(VLOOKUP($A566,Filtro!$A$5:$K$272,6,FALSE),0)","v":0},{"$f":"IFERROR(VLOOKUP($A566,Filtro!$A$5:$K$272,7,FALSE),0)","v":2}]
["81602207",1602207,"Tratamiento por electro de hemangiomas o telangectasias hasta 15 lesiones",2,{"$f":"IFERROR(VLOOKUP($A567,Filtro!$A$5:$K$272,3,FALSE),0)","v":0},{"$f":"IFERROR(VLOOKUP($A567,Filtro!$A$5:$K$272,4,FALSE),0)","v":2},{"$f":"IFERROR(VLOOKUP($A567,Filtro!$A$5:$K$272,5,FALSE),0)","v":2},{"$f":"IFERROR(VLOOKUP($A567,Filtro!$A$5:$K$272,6,FALSE),0)","v":0},{"$f":"IFERROR(VLOOKUP($A567,Filtro!$A$5:$K$272,7,FALSE),0)","v":2}]
["81602211",1602211,"Cabeza, cuello, genitales: tratamiento quirúrgico de tumor maligno por escisión total o parcial, con o sin sutura, por cada lesión o melanoma cualquier localización",0,{"$f":"IFERROR(VLOOKUP($A568,Filtro!$A$5:$K$272,3,FALSE),0)","v":0},{"$f":"IFERROR(VLOOKUP($A568,Filtro!$A$5:$K$272,4,FALSE),0)","v":0},{"$f":"IFERROR(VLOOKUP($A568,Filtro!$A$5:$K$272,5,FALSE),0)","v":0},{"$f":"IFERROR(VLOOKUP($A568,Filtro!$A$5:$K$272,6,FALSE),0)","v":0},{"$f":"IFERROR(VLOOKUP($A568,Filtro!$A$5:$K$272,7,FALSE),0)","v":0}]
["81602212",1602212,"Resto del cuerpo: tratamiento quirúrgico de tumor maligno por escisión total o parcial, con o sin sutura, por cada lesión",0,{"$f":"IFERROR(VLOOKUP($A569,Filtro!$A$5:$K$272,3,FALSE),0)","v":0},{"$f":"IFERROR(VLOOKUP($A569,Filtro!$A$5:$K$272,4,FALSE),0)","v":0},{"$f":"IFERROR(VLOOKUP($A569,Filtro!$A$5:$K$272,5,FALSE),0)","v":0},{"$f":"IFERROR(VLOOKUP($A569,Filtro!$A$5:$K$272,6,FALSE),0)","v":0},{"$f":"IFERROR(VLOOKUP($A569,Filtro!$A$5:$K$272,7,FALSE),0)","v":0}]
["81602213",1602213,"Cabeza, cuello, genitales o melanoma cualquier ubicación: ampliación de márgenes quirúrgicos de tumor maligno extirpado previamente ",0,{"$f":"IFERROR(VLOOKUP($A570,Filtro!$A$5:$K$272,3,FALSE),0)","v":0},{"$f":"IFERROR(VLOOKUP($A570,Filtro!$A$5:$K$272,4,FALSE),0)","v":0},{"$f":"IFERROR(VLOOKUP($A570,Filtro!$A$5:$K$272,5,FALSE),0)","v":0},{"$f":"IFERROR(VLOOKUP($A570,Filtro!$A$5:$K$272,6,FALSE),0)","v":0},{"$f":"IFERROR(VLOOKUP($A570,Filtro!$A$5:$K$272,7,FALSE),0)","v":0}]
["81602214",1602214,"Resto del cuerpo: ampliación de márgenes quirúrgicos de tumor maligno extirpado prevíamente",0,{"$f":"IFERROR(VLOOKUP($A571,Filtro!$A$5:$K$272,3,FALSE),0)","v":0},{"$f":"IFERROR(VLOOKUP($A571,Filtro!$A$5:$K$272,4,FALSE),0)","v":0},{"$f":"IFERROR(VLOOKUP($A571,Filtro!$A$5:$K$272,5,FALSE),0)","v":0},{"$f":"IFERROR(VLOOKUP($A571,Filtro!$A$5:$K$272,6,FALSE),0)","v":0},{"$f":"IFERROR(VLOOKUP($A571,Filtro!$A$5:$K$272,7,FALSE),0)","v":0}]
["81602215",1602215,"Tumores vasculares profundos cara, cuero cabelludo, cuello, genitales",0,{"$f":"IFERROR(VLOOKUP($A572,Filtro!$A$5:$K$272,3,FALSE),0)","v":0},{"$f":"IFERROR(VLOOKUP($A572,Filtro!$A$5:$K$272,4,FALSE),0)","v":0},{"$f":"IFERROR(VLOOKUP($A572,Filtro!$A$5:$K$272,5,FALSE),0)","v":0},{"$f":"IFERROR(VLOOKUP($A572,Filtro!$A$5:$K$272,6,FALSE),0)","v":0},{"$f":"IFERROR(VLOOKUP($A572,Filtro!$A$5:$K$272,7,FALSE),0)","v":0}]
["81602216",1602216,"Tumores vasculares profundos resto del cuerpo",0,{"$f":"IFERROR(VLOOKUP($A573,Filtro!$A$5:$K$272,3,FALSE),0)","v":0},{"$f":"IFERROR(VLOOKUP($A573,Filtro!$A$5:$K$272,4,FALSE),0)","v":0},{"$f":"IFERROR(VLOOKUP($A573,Filtro!$A$5:$K$272,5,FALSE),0)","v":0},{"$f":"IFERROR(VLOOKUP($A573,Filtro!$A$5:$K$272,6,FALSE),0)","v":0},{"$f":"IFERROR(VLOOKUP($A573,Filtro!$A$5:$K$272,7,FALSE),0)","v":0}]
["81602221",1602221,"Herida cortante o contusa complicada, reparación y sutura (más de 5 cm)",287,{"$f":"IFERROR(VLOOKUP($A574,Filtro!$A$5:$K$272,3,FALSE),0)","v":269},{"$f":"IFERROR(VLOOKUP($A574,Filtro!$A$5:$K$272,4,FALSE),0)","v":18},{"$f":"IFERROR(VLOOKUP($A574,Filtro!$A$5:$K$272,5,FALSE),0)","v":143},{"$f":"IFERROR(VLOOKUP($A574,Filtro!$A$5:$K$272,6,FALSE),0)","v":104},{"$f":"IFERROR(VLOOKUP($A574,Filtro!$A$5:$K$272,7,FALSE),0)","v":0}]
["81602222",1602222,"Herida cortante o contusa NO complicada, reparacion y sutura (una o multiples de mas de 5 cms de largo total y/o que comprometa solo piel)                                                                             ",610,{"$f":"IFERROR(VLOOKUP($A575,Filtro!$A$5:$K$272,3,FALSE),0)","v":554},{"$f":"IFERROR(VLOOKUP($A575,Filtro!$A$5:$K$272,4,FALSE),0)","v":56},{"$f":"IFERROR(VLOOKUP($A575,Filtro!$A$5:$K$272,5,FALSE),0)","v":226},{"$f":"IFERROR(VLOOKUP($A575,Filtro!$A$5:$K$272,6,FALSE),0)","v":286},{"$f":"IFERROR(VLOOKUP($A575,Filtro!$A$5:$K$272,7,FALSE),0)","v":0}]
["81602217",1602223,"Cabeza, cuello, genitales: extirpación de lesión benigna subepidérmica, incluye tumor sólido, quiste epidérmico y lipoma por lesión ",19,{"$f":"IFERROR(VLOOKUP($A576,Filtro!$A$5:$K$272,3,FALSE),0)","v":0},{"$f":"IFERROR(VLOOKUP($A576,Filtro!$A$5:$K$272,4,FALSE),0)","v":19},{"$f":"IFERROR(VLOOKUP($A576,Filtro!$A$5:$K$272,5,FALSE),0)","v":19},{"$f":"IFERROR(VLOOKUP($A576,Filtro!$A$5:$K$272,6,FALSE),0)","v":0},{"$f":"IFERROR(VLOOKUP($A576,Filtro!$A$5:$K$272,7,FALSE),0)","v":4}]
["81602224",1602224,"Resto del cuerpo: extirpación de lesión benigna subepidérmica, incluye tumor sólido, quiste epidérmico y lipoma por lesión ",29,{"$f":"IFERROR(VLOOKUP($A577,Filtro!$A$5:$K$272,3,FALSE),0)","v":0},{"$f":"IFERROR(VLOOKUP($A577,Filtro!$A$5:$K$272,4,FALSE),0)","v":29},{"$f":"IFERROR(VLOOKUP($A577,Filtro!$A$5:$K$272,5,FALSE),0)","v":29},{"$f":"IFERROR(VLOOKUP($A577,Filtro!$A$5:$K$272,6,FALSE),0)","v":0},{"$f":"IFERROR(VLOOKUP($A577,Filtro!$A$5:$K$272,7,FALSE),0)","v":10}]
["81602225",1602225,"Vaciamiento y curetaje quirurgico de lesiones quistica o abscesos                              ",42,{"$f":"IFERROR(VLOOKUP($A578,Filtro!$A$5:$K$272,3,FALSE),0)","v":32},{"$f":"IFERROR(VLOOKUP($A578,Filtro!$A$5:$K$272,4,FALSE),0)","v":10},{"$f":"IFERROR(VLOOKUP($A578,Filtro!$A$5:$K$272,5,FALSE),0)","v":41},{"$f":"IFERROR(VLOOKUP($A578,Filtro!$A$5:$K$272,6,FALSE),0)","v":1},{"$f":"IFERROR(VLOOKUP($A578,Filtro!$A$5:$K$272,7,FALSE),0)","v":0}]
["81602231",1602231,"Onisectomia total o parcial simple                                                                                      ",38,{"$f":"IFERROR(VLOOKUP($A579,Filtro!$A$5:$K$272,3,FALSE),0)","v":0},{"$f":"IFERROR(VLOOKUP($A579,Filtro!$A$5:$K$272,4,FALSE),0)","v":38},{"$f":"IFERROR(VLOOKUP($A579,Filtro!$A$5:$K$272,5,FALSE),0)","v":23},{"$f":"IFERROR(VLOOKUP($A579,Filtro!$A$5:$K$272,6,FALSE),0)","v":7},{"$f":"IFERROR(VLOOKUP($A579,Filtro!$A$5:$K$272,7,FALSE),0)","v":9}]
["81602232",1602232,"Cirugia reparadora ungueal por proceso inflamatorio                                                                 ",0,{"$f":"IFERROR(VLOOKUP($A580,Filtro!$A$5:$K$272,3,FALSE),0)","v":0},{"$f":"IFERROR(VLOOKUP($A580,Filtro!$A$5:$K$272,4,FALSE),0)","v":0},{"$f":"IFERROR(VLOOKUP($A580,Filtro!$A$5:$K$272,5,FALSE),0)","v":0},{"$f":"IFERROR(VLOOKUP($A580,Filtro!$A$5:$K$272,6,FALSE),0)","v":0},{"$f":"IFERROR(VLOOKUP($A580,Filtro!$A$5:$K$272,7,FALSE),0)","v":0}]
["81602223",1602233,"Correccion quirurgica de defecto congenito o por tumor ungueal",0,{"$f":"IFERROR(VLOOKUP($A581,Filtro!$A$5:$K$272,3,FALSE),0)","v":0},{"$f":"IFERROR(VLOOKUP($A581,Filtro!$A$5:$K$272,4,FALSE),0)","v":0},{"$f":"IFERROR(VLOOKUP($A581,Filtro!$A$5:$K$272,5,FALSE),0)","v":0},{"$f":"IFERROR(VLOOKUP($A581,Filtro!$A$5:$K$272,6,FALSE),0)","v":0},{"$f":"IFERROR(VLOOKUP($A581,Filtro!$A$5:$K$272,7,FALSE),0)","v":0}]
["81602240",1602240,"Curacion por medico, quemadura o similar menor al 5% superficie corporal en pabellon       ",23,{"$f":"IFERROR(VLOOKUP($A582,Filtro!$A$5:$K$272,3,FALSE),0)","v":22},{"$f":"IFERROR(VLOOKUP($A582,Filtro!$A$5:$K$272,4,FALSE),0)","v":1},{"$f":"IFERROR(VLOOKUP($A582,Filtro!$A$5:$K$272,5,FALSE),0)","v":7},{"$f":"IFERROR(VLOOKUP($A582,Filtro!$A$5:$K$272,6,FALSE),0)","v":16},{"$f":"IFERROR(VLOOKUP($A582,Filtro!$A$5:$K$272,7,FALSE),0)","v":0}]
["81602241",1602241,"Curacion por medico, quemadura o similar  5 a 10% superficie corporal en pabellon        ",9,{"$f":"IFERROR(VLOOKUP($A583,Filtro!$A$5:$K$272,3,FALSE),0)","v":9},{"$f":"IFERROR(VLOOKUP($A583,Filtro!$A$5:$K$272,4,FALSE),0)","v":0},{"$f":"IFERROR(VLOOKUP($A583,Filtro!$A$5:$K$272,5,FALSE),0)","v":4},{"$f":"IFERROR(VLOOKUP($A583,Filtro!$A$5:$K$272,6,FALSE),0)","v":5},{"$f":"IFERROR(VLOOKUP($A583,Filtro!$A$5:$K$272,7,FALSE),0)","v":0}]
["81602242",1602242,"Curacion por medico, quemadura o similar  mayor  al 10% superficie corporal en pabellon",2,{"$f":"IFERROR(VLOOKUP($A584,Filtro!$A$5:$K$272,3,FALSE),0)","v":2},{"$f":"IFERROR(VLOOKUP($A584,Filtro!$A$5:$K$272,4,FALSE),0)","v":0},{"$f":"IFERROR(VLOOKUP($A584,Filtro!$A$5:$K$272,5,FALSE),0)","v":1},{"$f":"IFERROR(VLOOKUP($A584,Filtro!$A$5:$K$272,6,FALSE),0)","v":1},{"$f":"IFERROR(VLOOKUP($A584,Filtro!$A$5:$K$272,7,FALSE),0)","v":0}]
[null,"TOTAL",null,{"$f":"SUM(D561:D584)","v":{"v":1088,"d":"1,088"}},{"$f":"SUM(E561:E584)","v":888},{"$f":"SUM(F561:F584)","v":200},{"$f":"SUM(G561:G584)","v":520},420,44]
[]
[null,"SECCIÓN D: MISCELÁNEOS"]
["80106002","0106002","Curación simple ambulatoria",{"$f":"SUM(E588:F588)","v":{"v":17867,"d":"17,867"}},{"$f":"IFERROR(VLOOKUP($A588,Filtro!$A$5:$K$272,3,FALSE),0)","v":{"v":3210,"d":"3,210"}},{"$f":"IFERROR(VLOOKUP($A588,Filtro!$A$5:$K$272,4,FALSE),0)","v":{"v":14657,"d":"14,657"}},{"$f":"IFERROR(VLOOKUP($A588,Filtro!$A$5:$K$272,5,FALSE),0)","v":44},{"$f":"IFERROR(VLOOKUP($A588,Filtro!$A$5:$K$272,6,FALSE),0)","v":{"v":16530,"d":"16,530"}},{"$f":"IFERROR(VLOOKUP($A588,Filtro!$A$5:$K$272,7,FALSE),0)","v":192}]
["80106005","0106005","Autocontrol pacientes Diabetico insulino dependiente (D.I.D. mensual)",{"$f":"SUM(E589:F589)","v":452},{"$f":"IFERROR(VLOOKUP($A589,Filtro!$A$5:$K$272,3,FALSE),0)","v":81},{"$f":"IFERROR(VLOOKUP($A589,Filtro!$A$5:$K$272,4,FALSE),0)","v":371},{"$f":"IFERROR(VLOOKUP($A589,Filtro!$A$5:$K$272,5,FALSE),0)","v":19},{"$f":"IFERROR(VLOOKUP($A589,Filtro!$A$5:$K$272,6,FALSE),0)","v":395},{"$f":"IFERROR(VLOOKUP($A589,Filtro!$A$5:$K$272,7,FALSE),0)","v":0}]
["80106024",null,"Curación avanzada por UV",{"v":1654,"d":"1,654"},{"$f":"IFERROR(VLOOKUP($A590,Filtro!$A$5:$K$272,3,FALSE),0)","v":62},{"$f":"IFERROR(VLOOKUP($A590,Filtro!$A$5:$K$272,4,FALSE),0)","v":{"v":1592,"d":"1,592"}},{"$f":"IFERROR(VLOOKUP($A590,Filtro!$A$5:$K$272,5,FALSE),0)","v":0},{"$f":"IFERROR(VLOOKUP($A590,Filtro!$A$5:$K$272,6,FALSE),0)","v":{"v":1556,"d":"1,556"}},{"$f":"IFERROR(VLOOKUP($A590,Filtro!$A$5:$K$272,7,FALSE),0)","v":0}]
["80106006","0106006","Oxigenoterapia domiciliaria (pacientes oxígeno dependientes)",117,{"$f":"IFERROR(VLOOKUP($A591,Filtro!$A$5:$K$272,3,FALSE),0)","v":74},{"$f":"IFERROR(VLOOKUP($A591,Filtro!$A$5:$K$272,4,FALSE),0)","v":43},{"$f":"IFERROR(VLOOKUP($A591,Filtro!$A$5:$K$272,5,FALSE),0)","v":0},{"$f":"IFERROR(VLOOKUP($A591,Filtro!$A$5:$K$272,6,FALSE),0)","v":102},{"$f":"IFERROR(VLOOKUP($A591,Filtro!$A$5:$K$272,7,FALSE),0)","v":0}]
["80106017","0106017","Curación compleja",{"v":10353,"d":"10,353"},{"$f":"IFERROR(VLOOKUP($A592,Filtro!$A$5:$K$272,3,FALSE),0)","v":374},{"$f":"IFERROR(VLOOKUP($A592,Filtro!$A$5:$K$272,4,FALSE),0)","v":{"v":9979,"d":"9,979"}},{"$f":"IFERROR(VLOOKUP($A592,Filtro!$A$5:$K$272,5,FALSE),0)","v":10},{"$f":"IFERROR(VLOOKUP($A592,Filtro!$A$5:$K$272,6,FALSE),0)","v":{"v":10232,"d":"10,232"}},{"$f":"IFERROR(VLOOKUP($A592,Filtro!$A$5:$K$272,7,FALSE),0)","v":0}]
["80106007","0106007","Extracción cuerpo extraño ojo",148,{"$f":"IFERROR(VLOOKUP($A593,Filtro!$A$5:$K$272,3,FALSE),0)","v":85},{"$f":"IFERROR(VLOOKUP($A593,Filtro!$A$5:$K$272,4,FALSE),0)","v":63},{"$f":"IFERROR(VLOOKUP($A593,Filtro!$A$5:$K$272,5,FALSE),0)","v":12},{"$f":"IFERROR(VLOOKUP($A593,Filtro!$A$5:$K$272,6,FALSE),0)","v":116},{"$f":"IFERROR(VLOOKUP($A593,Filtro!$A$5:$K$272,7,FALSE),0)","v":0}]
["80106008","0106008","Extracción cuerpo extraño otro lugar",131,{"$f":"IFERROR(VLOOKUP($A594,Filtro!$A$5:$K$272,3,FALSE),0)","v":66},{"$f":"IFERROR(VLOOKUP($A594,Filtro!$A$5:$K$272,4,FALSE),0)","v":65},{"$f":"IFERROR(VLOOKUP($A594,Filtro!$A$5:$K$272,5,FALSE),0)","v":17},{"$f":"IFERROR(VLOOKUP($A594,Filtro!$A$5:$K$272,6,FALSE),0)","v":83},{"$f":"IFERROR(VLOOKUP($A594,Filtro!$A$5:$K$272,7,FALSE),0)","v":0}]
["80106009","0106009","Lavado gástrico",5,{"$f":"IFERROR(VLOOKUP($A595,Filtro!$A$5:$K$272,3,FALSE),0)","v":4},{"$f":"IFERROR(VLOOKUP($A595,Filtro!$A$5:$K$272,4,FALSE),0)","v":1},{"$f":"IFERROR(VLOOKUP($A595,Filtro!$A$5:$K$272,5,FALSE),0)","v":1},{"$f":"IFERROR(VLOOKUP($A595,Filtro!$A$5:$K$272,6,FALSE),0)","v":4},{"$f":"IFERROR(VLOOKUP($A595,Filtro!$A$5:$K$272,7,FALSE),0)","v":0}]
["80106010","0106010","Lavado oído",178,{"$f":"IFERROR(VLOOKUP($A596,Filtro!$A$5:$K$272,3,FALSE),0)","v":6},{"$f":"IFERROR(VLOOKUP($A596,Filtro!$A$5:$K$272,4,FALSE),0)","v":172},{"$f":"IFERROR(VLOOKUP($A596,Filtro!$A$5:$K$272,5,FALSE),0)","v":78},{"$f":"IFERROR(VLOOKUP($A596,Filtro!$A$5:$K$272,6,FALSE),0)","v":55},{"$f":"IFERROR(VLOOKUP($A596,Filtro!$A$5:$K$272,7,FALSE),0)","v":0}]
["80106011","0106011","Técnicas reanimación cardiopulmonar básico",3,{"$f":"IFERROR(VLOOKUP($A597,Filtro!$A$5:$K$272,3,FALSE),0)","v":2},{"$f":"IFERROR(VLOOKUP($A597,Filtro!$A$5:$K$272,4,FALSE),0)","v":1},{"$f":"IFERROR(VLOOKUP($A597,Filtro!$A$5:$K$272,5,FALSE),0)","v":0},{"$f":"IFERROR(VLOOKUP($A597,Filtro!$A$5:$K$272,6,FALSE),0)","v":3},{"$f":"IFERROR(VLOOKUP($A597,Filtro!$A$5:$K$272,7,FALSE),0)","v":0}]
["80106012","0106012","Técnicas reanimación cardiopulmonar avanzado",9,{"$f":"IFERROR(VLOOKUP($A598,Filtro!$A$5:$K$272,3,FALSE),0)","v":9},{"$f":"IFERROR(VLOOKUP($A598,Filtro!$A$5:$K$272,4,FALSE),0)","v":0},{"$f":"IFERROR(VLOOKUP($A598,Filtro!$A$5:$K$272,5,FALSE),0)","v":3},{"$f":"IFERROR(VLOOKUP($A598,Filtro!$A$5:$K$272,6,FALSE),0)","v":6},{"$f":"IFERROR(VLOOKUP($A598,Filtro!$A$5:$K$272,7,FALSE),0)","v":0}]
["80106013","0106013","Aseo ocular",473,{"$f":"IFERROR(VLOOKUP($A599,Filtro!$A$5:$K$272,3,FALSE),0)","v":321},{"$f":"IFERROR(VLOOKUP($A599,Filtro!$A$5:$K$272,4,FALSE),0)","v":152},{"$f":"IFERROR(VLOOKUP($A599,Filtro!$A$5:$K$272,5,FALSE),0)","v":18},{"$f":"IFERROR(VLOOKUP($A599,Filtro!$A$5:$K$272,6,FALSE),0)","v":445},{"$f":"IFERROR(VLOOKUP($A599,Filtro!$A$5:$K$272,7,FALSE),0)","v":0}]
["80106014","0106014","Administración inyecciones",{"v":61257,"d":"61,257"},{"$f":"IFERROR(VLOOKUP($A600,Filtro!$A$5:$K$272,3,FALSE),0)","v":{"v":35692,"d":"35,692"}},{"$f":"IFERROR(VLOOKUP($A600,Filtro!$A$5:$K$272,4,FALSE),0)","v":{"v":25565,"d":"25,565"}},{"$f":"IFERROR(VLOOKUP($A600,Filtro!$A$5:$K$272,5,FALSE),0)","v":456},{"$f":"IFERROR(VLOOKUP($A600,Filtro!$A$5:$K$272,6,FALSE),0)","v":{"v":57606,"d":"57,606"}},{"$f":"IFERROR(VLOOKUP($A600,Filtro!$A$5:$K$272,7,FALSE),0)","v":380}]
["80106015","0106015","Administración fleboclisis",{"v":10144,"d":"10,144"},{"$f":"IFERROR(VLOOKUP($A601,Filtro!$A$5:$K$272,3,FALSE),0)","v":{"v":8398,"d":"8,398"}},{"$f":"IFERROR(VLOOKUP($A601,Filtro!$A$5:$K$272,4,FALSE),0)","v":{"v":1746,"d":"1,746"}},{"$f":"IFERROR(VLOOKUP($A601,Filtro!$A$5:$K$272,5,FALSE),0)","v":10},{"$f":"IFERROR(VLOOKUP($A601,Filtro!$A$5:$K$272,6,FALSE),0)","v":{"v":9120,"d":"9,120"}},{"$f":"IFERROR(VLOOKUP($A601,Filtro!$A$5:$K$272,7,FALSE),0)","v":0}]
["80106020","0106020","Administración oxigeno",609,{"$f":"IFERROR(VLOOKUP($A602,Filtro!$A$5:$K$272,3,FALSE),0)","v":424},{"$f":"IFERROR(VLOOKUP($A602,Filtro!$A$5:$K$272,4,FALSE),0)","v":185},{"$f":"IFERROR(VLOOKUP($A602,Filtro!$A$5:$K$272,5,FALSE),0)","v":3},{"$f":"IFERROR(VLOOKUP($A602,Filtro!$A$5:$K$272,6,FALSE),0)","v":545},{"$f":"IFERROR(VLOOKUP($A602,Filtro!$A$5:$K$272,7,FALSE),0)","v":0}]
["80106021","0106021","Aspiración secreciones",53,{"$f":"IFERROR(VLOOKUP($A603,Filtro!$A$5:$K$272,3,FALSE),0)","v":15},{"$f":"IFERROR(VLOOKUP($A603,Filtro!$A$5:$K$272,4,FALSE),0)","v":38},{"$f":"IFERROR(VLOOKUP($A603,Filtro!$A$5:$K$272,5,FALSE),0)","v":0},{"$f":"IFERROR(VLOOKUP($A603,Filtro!$A$5:$K$272,6,FALSE),0)","v":50},{"$f":"IFERROR(VLOOKUP($A603,Filtro!$A$5:$K$272,7,FALSE),0)","v":0}]
["80106022","0106022","Instalación sonda",492,{"$f":"IFERROR(VLOOKUP($A604,Filtro!$A$5:$K$272,3,FALSE),0)","v":218},{"$f":"IFERROR(VLOOKUP($A604,Filtro!$A$5:$K$272,4,FALSE),0)","v":274},{"$f":"IFERROR(VLOOKUP($A604,Filtro!$A$5:$K$272,5,FALSE),0)","v":2},{"$f":"IFERROR(VLOOKUP($A604,Filtro!$A$5:$K$272,6,FALSE),0)","v":457},{"$f":"IFERROR(VLOOKUP($A604,Filtro!$A$5:$K$272,7,FALSE),0)","v":0}]
["80106023",null,"Procedimientos de podología",{"v":5618,"d":"5,618"},{"$f":"IFERROR(VLOOKUP($A605,Filtro!$A$5:$K$272,3,FALSE),0)","v":367},{"$f":"IFERROR(VLOOKUP($A605,Filtro!$A$5:$K$272,4,FALSE),0)","v":{"v":5251,"d":"5,251"}},{"$f":"IFERROR(VLOOKUP($A605,Filtro!$A$5:$K$272,5,FALSE),0)","v":0},{"$f":"IFERROR(VLOOKUP($A605,Filtro!$A$5:$K$272,6,FALSE),0)","v":{"v":5447,"d":"5,447"}},{"$f":"IFERROR(VLOOKUP($A605,Filtro!$A$5:$K$272,7,FALSE),0)","v":0}]
[null,"TOTAL",null,{"$f":"SUM(D588:D605)","v":{"v":109563,"d":"109,563"}},{"$f":"SUM(E588:E605)","v":{"v":49408,"d":"49,408"}},{"$f":"SUM(F588:F605)","v":{"v":60155,"d":"60,155"}},673,{"v":102752,"d":"102,752"},572]
[]
[null,"CÓDIGOS","OTROS PROCEDIMIENTOS","Total","SAPU/SAR/SUR","Resto Establecimientos APS","Compras de Servicios"]
[]
["80307011","0307011","Toma de muestra de sangre venosa en adultos",{"$f":"SUM(E610:F610)","v":{"v":52086,"d":"52,086"}},{"$f":"IFERROR(VLOOKUP($A610,Filtro!$A$5:$K$272,3,FALSE),0)","v":{"v":1041,"d":"1,041"}},{"$f":"IFERROR(VLOOKUP($A610,Filtro!$A$5:$K$272,4,FALSE),0)","v":{"v":51045,"d":"51,045"}},{"$f":"IFERROR(VLOOKUP($A610,Filtro!$A$5:$K$272,5,FALSE),0)","v":{"v":21671,"d":"21,671"}}]
["80307012","0307012","Toma de muestra de sangre venosa en niños y lactantes",{"$f":"SUM(E611:F611)","v":{"v":1955,"d":"1,955"}},{"$f":"IFERROR(VLOOKUP($A611,Filtro!$A$5:$K$272,3,FALSE),0)","v":31},{"$f":"IFERROR(VLOOKUP($A611,Filtro!$A$5:$K$272,4,FALSE),0)","v":{"v":1924,"d":"1,924"}},{"$f":"IFERROR(VLOOKUP($A611,Filtro!$A$5:$K$272,5,FALSE),0)","v":469}]
[null,"TOTAL",null,{"$f":"SUM(D610:D611)","v":{"v":54041,"d":"54,041"}},{"$f":"SUM(E610:E611)","v":{"v":1072,"d":"1,072"}},{"$f":"SUM(F610:F611)","v":{"v":52969,"d":"52,969"}},{"$f":"SUM(G610:G611)","v":{"v":22140,"d":"22,140"}}]
[]
[null,"SECCIÓN E: OTROS EXÁMENES Y PROCEDIMIENTOS  DE APOYO CLÍNICO Y TERAPEUTICO (SIN CÓDIGO EN ARANCEL)"]
[null,"EXÁMENES Y/O PROCEDIMIENTO",null,"Total","SAPU/SAR/SUR","Resto Establecimientos APS","Funcionario",null,"Compras de Servicios"]
[{"$nulls":6},"Médico","Otro"]
["80500001","Toma agudeza visual (ambos ojos)",null,{"$f":"SUM(E617:F617)","v":168},{"$f":"IFERROR(VLOOKUP($A617,Filtro!$A$5:$K$272,3,FALSE),0)","v":0},{"$f":"IFERROR(VLOOKUP($A617,Filtro!$A$5:$K$272,4,FALSE),0)","v":168},{"$f":"IFERROR(VLOOKUP($A617,Filtro!$A$5:$K$272,5,FALSE),0)","v":0},{"$f":"IFERROR(VLOOKUP($A617,Filtro!$A$5:$K$272,6,FALSE),0)","v":168},{"$f":"IFERROR(VLOOKUP($A617,Filtro!$A$5:$K$272,7,FALSE),0)","v":0}]
["80500002","Autorrefractomia",null,{"$f":"SUM(E618:F618)","v":138},{"$f":"IFERROR(VLOOKUP($A618,Filtro!$A$5:$K$272,3,FALSE),0)","v":0},{"$f":"IFERROR(VLOOKUP($A618,Filtro!$A$5:$K$272,4,FALSE),0)","v":138},{"$f":"IFERROR(VLOOKUP($A618,Filtro!$A$5:$K$272,5,FALSE),0)","v":0},{"$f":"IFERROR(VLOOKUP($A618,Filtro!$A$5:$K$272,6,FALSE),0)","v":138},{"$f":"IFERROR(VLOOKUP($A618,Filtro!$A$5:$K$272,7,FALSE),0)","v":0}]
["80500003","Lensometria",null,0,{"$f":"IFERROR(VLOOKUP($A619,Filtro!$A$5:$K$272,3,FALSE),0)","v":0},{"$f":"IFERROR(VLOOKUP($A619,Filtro!$A$5:$K$272,4,FALSE),0)","v":0},{"$f":"IFERROR(VLOOKUP($A619,Filtro!$A$5:$K$272,5,FALSE),0)","v":0},{"$f":"IFERROR(VLOOKUP($A619,Filtro!$A$5:$K$272,6,FALSE),0)","v":0},{"$f":"IFERROR(VLOOKUP($A619,Filtro!$A$5:$K$272,7,FALSE),0)","v":0}]
["80500004","Paquimetria Ultrasónica",null,16,{"$f":"IFERROR(VLOOKUP($A620,Filtro!$A$5:$K$272,3,FALSE),0)","v":0},{"$f":"IFERROR(VLOOKUP($A620,Filtro!$A$5:$K$272,4,FALSE),0)","v":16},{"$f":"IFERROR(VLOOKUP($A620,Filtro!$A$5:$K$272,5,FALSE),0)","v":0},{"$f":"IFERROR(VLOOKUP($A620,Filtro!$A$5:$K$272,6,FALSE),0)","v":16},{"$f":"IFERROR(VLOOKUP($A620,Filtro!$A$5:$K$272,7,FALSE),0)","v":0}]
["80500005","Paquimetria óptica",null,0,{"$f":"IFERROR(VLOOKUP($A621,Filtro!$A$5:$K$272,3,FALSE),0)","v":0},{"$f":"IFERROR(VLOOKUP($A621,Filtro!$A$5:$K$272,4,FALSE),0)","v":0},{"$f":"IFERROR(VLOOKUP($A621,Filtro!$A$5:$K$272,5,FALSE),0)","v":0},{"$f":"IFERROR(VLOOKUP($A621,Filtro!$A$5:$K$272,6,FALSE),0)","v":0},{"$f":"IFERROR(VLOOKUP($A621,Filtro!$A$5:$K$272,7,FALSE),0)","v":0}]
["80500006","Tomografía coherencia óptica",null,38,{"$f":"IFERROR(VLOOKUP($A622,Filtro!$A$5:$K$272,3,FALSE),0)","v":0},{"$f":"IFERROR(VLOOKUP($A622,Filtro!$A$5:$K$272,4,FALSE),0)","v":38},{"$f":"IFERROR(VLOOKUP($A622,Filtro!$A$5:$K$272,5,FALSE),0)","v":0},{"$f":"IFERROR(VLOOKUP($A622,Filtro!$A$5:$K$272,6,FALSE),0)","v":38},{"$f":"IFERROR(VLOOKUP($A622,Filtro!$A$5:$K$272,7,FALSE),0)","v":0}]
["80500007","Inyeccion intravitrea avastin",null,133,{"$f":"IFERROR(VLOOKUP($A623,Filtro!$A$5:$K$272,3,FALSE),0)","v":132},{"$f":"IFERROR(VLOOKUP($A623,Filtro!$A$5:$K$272,4,FALSE),0)","v":1},{"$f":"IFERROR(VLOOKUP($A623,Filtro!$A$5:$K$272,5,FALSE),0)","v":1},{"$f":"IFERROR(VLOOKUP($A623,Filtro!$A$5:$K$272,6,FALSE),0)","v":0},{"$f":"IFERROR(VLOOKUP($A623,Filtro!$A$5:$K$272,7,FALSE),0)","v":0}]
["80500008","Insercion Implante Anticonceptivo",null,469,{"$f":"IFERROR(VLOOKUP($A624,Filtro!$A$5:$K$272,3,FALSE),0)","v":0},{"$f":"IFERROR(VLOOKUP($A624,Filtro!$A$5:$K$272,4,FALSE),0)","v":469},{"$f":"IFERROR(VLOOKUP($A624,Filtro!$A$5:$K$272,5,FALSE),0)","v":0},{"$f":"IFERROR(VLOOKUP($A624,Filtro!$A$5:$K$272,6,FALSE),0)","v":464},{"$f":"IFERROR(VLOOKUP($A624,Filtro!$A$5:$K$272,7,FALSE),0)","v":0}]
["80500009","Remocion Implante Anticonceptivo",null,284,{"$f":"IFERROR(VLOOKUP($A625,Filtro!$A$5:$K$272,3,FALSE),0)","v":0},{"$f":"IFERROR(VLOOKUP($A625,Filtro!$A$5:$K$272,4,FALSE),0)","v":284},{"$f":"IFERROR(VLOOKUP($A625,Filtro!$A$5:$K$272,5,FALSE),0)","v":0},{"$f":"IFERROR(VLOOKUP($A625,Filtro!$A$5:$K$272,6,FALSE),0)","v":283},{"$f":"IFERROR(VLOOKUP($A625,Filtro!$A$5:$K$272,7,FALSE),0)","v":0}]
["80500010","Insercion Pellets subcutáneo",null,0,{"$f":"IFERROR(VLOOKUP($A626,Filtro!$A$5:$K$272,3,FALSE),0)","v":0},{"$f":"IFERROR(VLOOKUP($A626,Filtro!$A$5:$K$272,4,FALSE),0)","v":0},{"$f":"IFERROR(VLOOKUP($A626,Filtro!$A$5:$K$272,5,FALSE),0)","v":0},{"$f":"IFERROR(VLOOKUP($A626,Filtro!$A$5:$K$272,6,FALSE),0)","v":0},{"$f":"IFERROR(VLOOKUP($A626,Filtro!$A$5:$K$272,7,FALSE),0)","v":0}]
["80500011","Hemoglocotest instantaneo ",null,{"v":12811,"d":"12,811"},{"$f":"IFERROR(VLOOKUP($A627,Filtro!$A$5:$K$272,3,FALSE),0)","v":{"v":7701,"d":"7,701"}},{"$f":"IFERROR(VLOOKUP($A627,Filtro!$A$5:$K$272,4,FALSE),0)","v":{"v":5110,"d":"5,110"}},{"$f":"IFERROR(VLOOKUP($A627,Filtro!$A$5:$K$272,5,FALSE),0)","v":65},{"$f":"IFERROR(VLOOKUP($A627,Filtro!$A$5:$K$272,6,FALSE),0)","v":{"v":12014,"d":"12,014"}},{"$f":"IFERROR(VLOOKUP($A627,Filtro!$A$5:$K$272,7,FALSE),0)","v":0}]
["80500014","Radiografía de pelvis, cadera o coxofemoral de 1er screening  (entre 3 -6 meses)",null,183,{"$f":"IFERROR(VLOOKUP($A628,Filtro!$A$5:$K$272,3,FALSE),0)","v":43},{"$f":"IFERROR(VLOOKUP($A628,Filtro!$A$5:$K$272,4,FALSE),0)","v":140},{"$f":"IFERROR(VLOOKUP($A628,Filtro!$A$5:$K$272,5,FALSE),0)","v":58},{"$f":"IFERROR(VLOOKUP($A628,Filtro!$A$5:$K$272,6,FALSE),0)","v":46},{"$f":"IFERROR(VLOOKUP($A628,Filtro!$A$5:$K$272,7,FALSE),0)","v":154}]
["80500016","Cartridge para Troponina",null,201,{"$f":"IFERROR(VLOOKUP($A629,Filtro!$A$5:$K$272,3,FALSE),0)","v":201},{"$f":"IFERROR(VLOOKUP($A629,Filtro!$A$5:$K$272,4,FALSE),0)","v":0},{"$f":"IFERROR(VLOOKUP($A629,Filtro!$A$5:$K$272,5,FALSE),0)","v":0},{"$f":"IFERROR(VLOOKUP($A629,Filtro!$A$5:$K$272,6,FALSE),0)","v":201},{"$f":"IFERROR(VLOOKUP($A629,Filtro!$A$5:$K$272,7,FALSE),0)","v":0}]
["80500017","Cartridge Multiple",null,627,{"$f":"IFERROR(VLOOKUP($A630,Filtro!$A$5:$K$272,3,FALSE),0)","v":627},{"$f":"IFERROR(VLOOKUP($A630,Filtro!$A$5:$K$272,4,FALSE),0)","v":0},{"$f":"IFERROR(VLOOKUP($A630,Filtro!$A$5:$K$272,5,FALSE),0)","v":0},{"$f":"IFERROR(VLOOKUP($A630,Filtro!$A$5:$K$272,6,FALSE),0)","v":627},{"$f":"IFERROR(VLOOKUP($A630,Filtro!$A$5:$K$272,7,FALSE),0)","v":0}]
[null,"TOTAL",null,{"$f":"SUM(D617:D630)","v":{"v":15068,"d":"15,068"}},{"$f":"SUM(E617:E630)","v":{"v":8704,"d":"8,704"}},{"$f":"SUM(F617:F630)","v":{"v":6364,"d":"6,364"}},{"$f":"SUM(G617:G630)","v":124},{"v":13995,"d":"13,995"},154]